program: Gaussian 09
title: 000184686
version: EM64L-G09RevD.01
frameworkgroup: C1[X(C17H26O4)]
method: RPBEPBE
basis: SDD
operation: Freq
keyword: #pfreq=noraman
keyword: PBEPBE/SDD
title: #p freq=noraman PBEPBE/SDD
converged: NO YES NO NO
title: Mulliken charges:
elementType: O O O O C C C C C C C C C C C C C C C C C H H H H H H H H H H H H H H H H H H H H H H H H H H
charge: -0.268771 -0.235426 -0.289379 -0.252192 0.346493 -0.090525 0.324288 -0.482427 -0.306152 -0.435975 -0.446974 -0.559631 -0.815282 -0.777313 -0.773168 0.301043 -0.387881 0.212735 0.105188 -0.509687 -0.501514 0.200959 0.195334 0.224051 0.264868 0.197489 0.190748 0.210011 0.199148 0.232629 0.241391 0.231760 0.221098 0.249307 0.222740 0.212372 0.218895 0.214391 0.214089 0.215990 0.259254 0.237848 0.231575 0.240769 0.227367 0.242688 0.245777
chargesum: 0.00000
title: Mulliken charges with hydrogens summed into heavy atoms:
elementType: O O O O C C C C C C C C C C C C C C C C C
charge: -0.268771 -0.235426 -0.289379 -0.252192 0.346493 0.110435 0.324288 -0.063043 -0.041283 -0.047737 -0.037815 -0.085610 -0.113117 -0.123306 -0.128698 0.301043 -0.128627 0.212735 0.105188 0.200505 0.214318
polarizability: 2.35351322e+02 1.14318341e+01 1.90716369e+02 -3.64669459e+00 -9.16437142e+00 1.49042412e+02
1716.lowfreq: -13.3963 -9.8891 -5.3984 0.0004 0.0006 0.0010 20.9512 51.3750 55.3896
frequency: 20.7094 51.3582 55.3541 67.0146 84.7155 91.7838 94.4762 107.5203 120.2940 139.2299 159.0810 178.6734 192.8741 209.4920 222.6444 223.7518 230.6137 260.1208 266.0360 271.7979 282.4296 291.3426 301.7707 316.4333 326.5562 351.5343 379.5268 404.8139 421.5537 429.0699 446.9355 494.3452 496.7926 529.8533 560.4867 592.9596 663.0395 680.7384 703.7914 720.3298 739.1984 767.9255 800.7117 839.4649 845.0347 864.9402 885.2536 886.7308 903.2467 923.0797 932.6932 935.4130 959.5603 965.9148 977.9140 982.6394 1001.9427 1024.5253 1033.5398 1051.9459 1063.8329 1079.1281 1096.1088 1110.3870 1113.8077 1116.6689 1118.6890 1145.1788 1147.5198 1149.2559 1159.2502 1182.4275 1189.8253 1201.9160 1220.1410 1226.9636 1246.3006 1260.2043 1290.3501 1304.1814 1312.8704 1329.1345 1333.9424 1342.5397 1346.6225 1349.7239 1357.3983 1376.1572 1393.5643 1401.7425 1418.4501 1420.9874 1442.2145 1450.4867 1451.8649 1452.2970 1460.0779 1462.5475 1464.4201 1464.6937 1471.6709 1474.2975 1477.3824 1481.1859 1492.9140 1495.8252 1617.5079 1637.5027 1666.5065 2922.6798 2953.2795 2962.4387 2964.1034 2966.3413 2981.3337 2982.8278 3000.1875 3001.3293 3002.8457 3003.6936 3013.4958 3015.5518 3031.3565 3040.6864 3058.1303 3064.0844 3065.6766 3084.8983 3089.7058 3100.8836 3104.6520 3115.2069 3119.2127 3144.6770 3144.9411
redmass: 3.8730 4.3566 3.5906 3.5967 1.6994 2.2448 1.2668 1.8074 2.9307 1.6303 1.9981 2.7996 2.0877 2.4742 1.8171 1.8383 3.4571 3.3663 3.3919 2.0225 2.4376 2.5925 2.6327 2.8652 3.0621 4.7811 2.9588 1.9522 4.0031 2.8986 3.3310 3.6762 3.1416 2.4126 3.2921 3.8341 4.7557 3.5884 4.3278 5.4382 4.5921 2.5764 3.5378 2.6690 1.9649 2.0127 4.4657 2.0809 2.7360 2.0521 1.6263 2.0237 2.0218 2.4183 1.6104 1.7542 2.8173 3.1448 1.6763 2.5018 2.2412 1.8033 2.1425 1.2718 1.2690 2.2702 1.7636 1.8361 1.4573 1.5218 2.0465 2.2345 1.5239 1.9316 2.0833 3.9201 1.4853 1.9911 1.3635 1.6377 1.5248 1.4066 1.6223 1.4182 1.7066 1.6196 1.3746 1.1956 1.2183 1.2004 1.1837 1.1866 1.0874 1.0521 1.0590 1.0752 1.0780 1.0500 1.0512 1.0514 1.0797 1.0613 1.0582 1.0575 1.0616 1.0560 10.3447 8.6735 7.8380 1.0816 1.0602 1.0633 1.0637 1.0366 1.0449 1.0558 1.0648 1.0417 1.0298 1.0417 1.0980 1.0936 1.0968 1.1012 1.0988 1.0981 1.0981 1.0979 1.0977 1.1041 1.1044 1.0962 1.0910 1.1048 1.1046
irintensity: 0.3458 1.2002 1.5365 0.4300 1.9680 0.4097 1.3518 1.1187 0.1937 1.7208 2.2128 0.8390 1.8197 0.6450 1.2736 3.2558 1.7433 1.9956 2.1511 4.1257 0.5908 5.4716 0.1156 10.6238 5.4980 2.5720 2.7512 0.3713 4.4159 1.3411 1.1198 4.1947 0.4260 3.5037 5.8749 2.1924 3.3752 3.8962 11.7996 19.9722 9.2812 2.6660 0.8857 8.5531 0.3724 4.8824 4.8030 6.3102 3.6111 3.9794 2.3589 1.2866 3.1532 10.9053 16.0973 12.3510 7.5487 86.1016 10.6679 31.5361 51.5074 2.5258 95.6663 0.1873 0.1843 40.7643 12.4606 55.9009 2.8051 72.3818 42.5157 33.0858 44.6528 5.4435 10.0224 192.6648 2.3520 29.4616 20.6615 25.4123 3.4425 2.5547 4.1695 2.3388 0.3616 3.7496 2.6515 14.6735 21.9306 31.8111 15.8790 26.5600 16.2764 11.1735 11.7741 12.9194 7.0440 1.2323 17.6499 1.2395 8.8727 12.1629 7.9133 15.1864 4.4254 14.2491 219.4236 136.4396 41.3265 18.0405 34.0684 10.1198 32.4696 39.2486 27.2040 30.5764 18.7158 28.9770 44.1213 10.0250 53.6767 23.7102 42.0530 54.9779 15.3678 57.7705 61.5873 27.1599 31.5746 27.6281 22.4094 24.2387 4.8666 14.7339 17.9916
temp: 298.150 k
press: 1.00000 atm
elementType: 8 8 8 8 6 6 6 6 6 6 6 6 6 6 6 6 6 6 6 6 6 1 1 1 1 1 1 1 1 1 1 1 1 1 1 1 1 1 1 1 1 1 1 1 1 1 1
symmnumber: 1
zpe: 1046531.5 jmol-1
zpe.correction: 0.398603 hartree
zpe.thermalcorrener: 0.421456 hartree
zpe.thermalcorrenthalpy: 0.422401 hartree
zpe.thermalcorrgfe: 0.347233 hartree
zpe.sumelectzpe: -962.653362 hartree
zpe.sumelectthermal: -962.630508 hartree
zpe.sumelectthermalent: -962.629564 hartree
zpe.sumelectthermalfe: -962.704732 hartree
dipole: -1.6916 2.1730 -2.1441
dipole: 3.4900
quadrupole: -115.7936 -125.2624 -131.1110
quadrupole: 11.3434 -8.9341 1.4697
quadrupole: 8.2620 -1.2067 -7.0553 11.3434 -8.9341 1.4697
hfenergy: -963.0519648 hartree
pointgroup: C01 [X(C17H26O4)]
dipole: -0.7519245 0.7970465 -0.827459 debye
polarizability: 233.0448238|14.6251836|192.8006903|-4.9185079|-9.8608213|149.2645896 unknown
InChI: InChI=1S/C17H26O4/c1-16(2)9-6-10-17(3)12(16)8-7-11(14(18)20-4)13(17)15(19)21-5/h7,12-13H,6,8-10H2,1-5H3
charge 0 multiplicity 1
47 atoms
O  1.619703 2.446242 -0.583136
O  2.126958 1.336202 1.395355
O  3.23068 -0.41564 -0.855305
O  3.180533 -2.445154 0.287719
C  -0.896472 0.498967 0.250863
C  -1.707622 -0.769621 -0.223802
C  -3.286426 -0.667169 -0.221617
C  -1.470181 1.772008 -0.43946
C  0.595692 0.285993 -0.267799
C  -3.709541 0.68068 -0.883133
C  -2.997484 1.908398 -0.280531
C  -1.177947 -2.036773 0.491295
C  -0.895193 0.671875 1.794994
C  -3.955951 -0.786131 1.1774
C  -3.853164 -1.820508 -1.101781
C  1.131415 -1.110461 0.048197
C  0.320707 -2.144106 0.412261
C  1.529991 1.359779 0.295773
C  2.582874 -1.417539 -0.116189
C  2.497719 3.551737 -0.133291
C  4.68316 -0.610816 -1.056175
H  -1.446658 -0.884699 -1.30134
H  -1.233461 1.732538 -1.523606
H  -0.95795 2.669519 -0.045635
H  0.589388 0.430476 -1.365756
H  -4.810055 0.788405 -0.801921
H  -3.474058 0.635291 -1.967944
H  -3.266625 2.030242 0.786877
H  -3.340169 2.828162 -0.793092
H  -1.620981 -2.948719 0.046338
H  -1.486608 -2.04911 1.557676
H  -0.438221 1.636079 2.078703
H  -1.915397 0.65462 2.206814
H  -0.307862 -0.11643 2.296161
H  -3.617496 -1.683872 1.725294
H  -5.051687 -0.874872 1.049095
H  -3.774742 0.091648 1.819603
H  -3.716906 -2.812035 -0.632242
H  -3.368338 -1.841505 -2.096438
H  -4.939217 -1.67804 -1.259181
H  0.790923 -3.11386 0.624604
H  2.141245 3.963686 0.826179
H  2.439277 4.301632 -0.934759
H  3.530504 3.186207 -0.00368
H  4.994402 0.224797 -1.698995
H  4.875996 -1.582037 -1.542165
H  5.205147 -0.582489 -0.084822
