program: Gaussian 09
title: 000184661
version: EM64L-G09RevD.01
frameworkgroup: C1[X(C14H13N3O2)]
method: RPBEPBE
basis: SDD
operation: Freq
keyword: #p
keyword: freq=noraman
keyword: PBEPBE/SDD
title: #p freq=noraman PBEPBE/SDD
converged: YES YES NO NO
title: Mulliken charges:
elementType: O O N N N C C C C C C C C C C C C C C H H H H H H H H H H H H H
charge: -0.214274 -0.268147 -0.411926 -0.019583 -0.408414 0.006872 0.318593 0.245291 0.065924 -0.699837 -0.700332 -0.578016 -0.343892 0.422158 -0.370162 -0.012664 -0.200614 -0.293239 0.180199 0.210872 0.246189 0.231147 0.209862 0.230864 0.246412 0.322036 0.225976 0.240524 0.279084 0.228781 0.260602 0.349712
chargesum: 0.00000
title: Mulliken charges with hydrogens summed into heavy atoms:
elementType: O O N N N C C C C C C C C C C C C C C
charge: -0.214274 -0.268147 -0.089890 -0.019583 -0.058702 0.006872 0.318593 0.245291 0.065924 -0.011629 -0.013194 -0.352041 -0.103367 0.422158 -0.091077 -0.012664 0.028167 -0.032637 0.180199
polarizability: 3.34589593e+02 4.98558692e+00 1.71958196e+02 -1.72271165e+00 1.34518554e+00 8.88908311e+01
1716.lowfreq: -4.7847 -1.3621 0.0001 0.0004 0.0006 4.7733 11.3135 39.5166 74.0822
frequency: 10.3487 39.4985 74.0626 89.5577 109.6469 157.6563 191.9333 199.7343 207.4342 242.2206 254.2857 257.8531 287.0415 320.7065 324.9040 369.9471 391.1753 403.7946 459.7658 462.4982 503.8904 515.4853 549.6691 581.0223 615.8046 617.1127 622.0751 626.4420 691.8083 716.3636 726.7490 742.6104 762.2568 778.4547 801.0194 823.9248 831.0914 846.3107 877.5854 896.1146 944.0036 948.9698 965.1646 977.7974 982.7515 1008.1455 1029.0490 1076.0462 1114.3623 1141.3522 1143.5958 1145.2845 1196.2443 1204.7889 1240.1560 1241.4802 1251.9205 1284.5707 1309.5981 1328.7595 1371.9456 1380.8850 1391.5253 1400.4738 1416.3909 1450.0167 1459.4741 1466.0212 1476.8815 1485.2872 1489.5008 1496.9577 1572.2182 1602.8106 1632.1278 1663.4000 1670.4535 2983.6054 2985.1893 3083.2208 3087.0741 3091.4417 3095.5560 3138.0115 3144.1823 3157.3684 3172.6353 3184.8802 3513.9475 3572.4843
redmass: 4.2182 6.6130 5.6857 5.4178 4.3444 6.3658 3.3444 2.9826 1.0265 1.6726 3.6613 4.2757 2.7830 3.3732 3.6697 3.9950 5.6757 7.0433 3.4043 4.7281 8.4291 2.5068 3.9358 5.4618 1.6721 2.7175 5.3558 3.5911 6.3813 4.9664 5.6965 5.6237 3.7026 1.2842 7.3130 2.5716 1.6543 1.5510 5.0080 1.6140 2.2788 1.4922 3.6673 1.3636 1.3232 1.3109 2.6439 2.7988 1.8198 1.4042 4.2622 2.8703 4.3672 2.3646 1.7224 1.9194 2.5476 2.2032 2.2186 3.3353 1.1736 2.6974 1.2148 2.3942 2.3408 3.5734 1.0481 1.0486 1.0739 1.3512 2.4626 3.2518 5.6199 6.7050 7.2791 6.4236 9.2994 1.0340 1.0345 1.1010 1.1001 1.1014 1.1007 1.0910 1.0899 1.0879 1.0951 1.0980 1.0788 1.0796
irintensity: 1.0247 2.9262 0.4349 1.6566 3.4914 5.4510 0.1283 2.3498 0.0463 0.0075 1.1137 1.2813 2.4696 0.4323 0.1892 0.8797 6.9811 2.5712 10.4903 3.6593 28.2984 16.8779 21.7125 6.8445 59.9559 40.3689 3.0257 5.6062 3.0654 3.7852 13.3076 2.0731 0.0666 94.3457 9.7895 11.7393 76.6747 9.8970 0.1156 12.3991 5.4565 2.4033 77.2757 0.5841 0.0902 0.1209 0.6867 15.1463 43.5103 6.6468 5.3968 118.7784 116.9947 128.3043 25.4763 4.4907 7.2325 26.6001 20.3996 34.9505 12.8278 87.0979 27.0940 4.1502 14.6551 2.7370 7.5475 2.9303 16.1275 18.9814 17.9044 150.1076 160.6496 40.2087 114.4918 557.2332 326.7913 22.5061 21.2487 8.9496 28.8141 7.9880 33.2616 10.6316 9.1352 8.0770 3.5435 4.0061 55.6223 53.4924
temp: 298.150 k
press: 1.00000 atm
elementType: 8 8 7 7 7 6 6 6 6 6 6 6 6 6 6 6 6 6 6 1 1 1 1 1 1 1 1 1 1 1 1 1
symmnumber: 1
zpe: 646879.8 jmol-1
zpe.correction: 0.246384 hartree
zpe.thermalcorrener: 0.262693 hartree
zpe.thermalcorrenthalpy: 0.263637 hartree
zpe.thermalcorrgfe: 0.201234 hartree
zpe.sumelectzpe: -854.671146 hartree
zpe.sumelectthermal: -854.654837 hartree
zpe.sumelectthermalent: -854.653892 hartree
zpe.sumelectthermalfe: -854.716296 hartree
dipole: 1.7263 0.7461 -0.2451
dipole: 1.8965
quadrupole: -163.6724 -92.4213 -112.2601
quadrupole: -0.3346 0.2272 0.2789
quadrupole: -40.8878 30.3633 10.5245 -0.3346 0.2272 0.2789
hfenergy: -854.9175294 hartree
pointgroup: C01 [X(C14H13N3O2)]
dipole: 0.6867314 0.2761693 -0.0941197 debye
polarizability: 334.7447521|1.1430024|171.8363271|0.4955014|0.2495799|88.8575407 unknown
InChI: InChI=1S/C14H13N3O2/c1-14(2)9-7-8(3-4-11(9)15-13(14)19)10-5-6-12(18)17-16-10/h3-7,15,17H,1-2H3
charge 0 multiplicity 1
32 atoms
O  5.351651 -0.176489 0.046419
O  -6.177209 -0.466353 -0.004865
N  3.503676 1.301842 -0.052916
N  -2.947603 1.207245 0.091227
N  -4.282726 0.905658 0.089501
C  2.97239 -1.024973 0.078235
C  1.716835 -0.158009 0.011611
C  2.093373 1.210808 -0.06055
C  4.114198 0.036649 0.024589
C  3.089503 -1.819508 1.408798
C  3.11638 -1.982638 -1.136469
C  0.362774 -0.51026 0.017272
C  1.131854 2.237925 -0.124755
C  -0.638141 0.506225 -0.051646
C  -0.228821 1.868701 -0.119715
C  -2.08583 0.173047 -0.047607
C  -2.584746 -1.183421 -0.191165
C  -3.938448 -1.448925 -0.183184
C  -4.91405 -0.368408 -0.031236
H  2.312779 -2.604163 1.454204
H  4.082393 -2.298963 1.468239
H  2.96647 -1.159859 2.285588
H  2.33847 -2.766503 -1.097801
H  3.015134 -1.440637 -2.093033
H  4.108893 -2.465809 -1.111582
H  4.040171 2.168771 -0.096872
H  0.086542 -1.567575 0.08956
H  1.419387 3.292988 -0.180533
H  -1.004557 2.637896 -0.16839
H  -1.877173 -2.006698 -0.32318
H  -4.33607 -2.46109 -0.295896
H  -4.901598 1.715525 0.197654
