program: Gaussian 09
title: 000186513
version: EM64L-G09RevD.01
frameworkgroup: C1[X(C23H21Cl3O3)]
method: RPBEPBE
basis: SDD
operation: Freq
keyword: #p
keyword: freq=noraman
keyword: PBEPBE/SDD
title: #p freq=noraman PBEPBE/SDD
converged: YES YES NO NO
title: Mulliken charges:
elementType: Cl Cl Cl O O O C C C C C C C C C C C C C C C C C C C C C C C H H H H H H H H H H H H H H H H H H H H H
charge: 0.075111 0.096449 0.107565 -0.295742 -0.285502 -0.262501 -0.345319 0.586539 0.531224 -0.658132 -0.497980 -0.453518 0.244716 -0.355956 -0.403648 0.143964 -0.340319 -0.364416 -0.357141 0.321948 -0.418852 0.438208 -0.380239 -0.436719 -0.527058 -0.221325 -0.222580 -0.238479 -0.538169 0.278473 0.273540 0.233830 0.250459 0.240547 0.252988 0.240560 0.252256 0.228226 0.222927 0.260510 0.233573 0.228843 0.213252 0.267126 0.228915 0.228975 0.230480 0.222838 0.246750 0.222799
chargesum: 0.00000
title: Mulliken charges with hydrogens summed into heavy atoms:
elementType: Cl Cl Cl O O O C C C C C C C C C C C C C C C C C C C C C C C
charge: 0.075111 0.096449 0.107565 -0.295742 -0.285502 -0.262501 -0.066846 0.586539 0.531224 -0.658132 -0.224440 -0.219688 0.244716 -0.105496 -0.163101 0.143964 -0.087331 -0.123856 -0.104884 0.321948 0.032301 0.438208 -0.119729 -0.203146 0.182163 0.007591 0.006395 -0.007999 0.154218
polarizability: 3.79377411e+02 1.80954371e+00 2.67561376e+02 -7.53523740e+00 -5.20672389e+00 2.49905240e+02
1716.lowfreq: -4.7148 -3.1714 -0.0021 -0.0016 -0.0012 4.5727 8.8956 18.7536 27.2505
frequency: 8.1264 18.6654 27.2183 31.0575 38.2413 38.9976 50.2178 57.6082 74.4660 83.5683 98.2477 103.9452 109.3247 134.9276 159.0649 168.2731 177.3227 186.8046 188.8359 203.2193 224.1183 238.2666 239.3981 257.5594 270.7172 277.4383 285.2404 295.5131 333.6911 358.8768 374.1479 399.2313 402.6926 414.5590 444.9001 461.3570 469.6102 485.1671 517.9421 524.7094 548.8828 565.6970 591.9722 613.3722 616.5862 624.3150 634.2393 682.2070 690.4246 703.3521 724.7825 738.7144 744.5653 752.5994 771.6231 785.1614 809.5773 819.6291 826.9310 832.0020 853.0505 857.7000 888.5553 916.6629 934.6499 939.6809 942.3514 955.3412 959.2880 980.6189 984.0807 988.7268 990.1079 996.9336 1003.0698 1009.7541 1011.4586 1027.3196 1086.7538 1110.5312 1111.1532 1112.1803 1116.0408 1146.3824 1155.8745 1157.5183 1173.0355 1181.0613 1187.3551 1189.8752 1201.7167 1210.5102 1224.1836 1236.2051 1243.4570 1257.9513 1278.6877 1310.0086 1312.5077 1318.2801 1356.8838 1380.9291 1386.2368 1391.8725 1410.6968 1419.6834 1433.0310 1436.7984 1441.7194 1455.9076 1467.4911 1471.4984 1472.8951 1482.5766 1485.8000 1498.7530 1500.9738 1580.3770 1582.2394 1595.8865 1608.9075 1618.3674 1620.8142 2941.7444 2961.6511 2977.1867 2997.4159 3007.4960 3050.6561 3085.9627 3117.3737 3127.2350 3127.9498 3128.2931 3130.7862 3134.1623 3141.6574 3146.0450 3154.8666 3166.2766 3166.7046 3167.2879 3170.6104 3178.7495
redmass: 6.5351 3.9412 5.1826 5.2106 6.1974 4.8303 6.3042 6.0449 2.8849 6.0578 4.0064 3.7900 2.4089 7.1910 3.4189 2.0051 5.8167 6.1964 8.2891 7.0434 3.3543 1.8340 2.7196 4.9847 6.6717 13.1060 5.0070 4.2647 8.2490 6.8487 5.9201 4.3486 2.9195 2.9228 4.8936 5.0833 3.2472 3.7464 3.3064 4.8462 5.1558 5.4313 5.2730 6.1530 6.1925 5.5559 6.7592 6.1609 7.1412 2.1182 4.2031 3.9787 1.9079 3.1173 5.1509 4.6895 1.4722 1.6774 3.5857 1.6393 2.7034 1.2611 1.6142 1.4178 4.6464 1.4506 1.4112 6.9732 1.3784 1.4467 5.5098 7.0211 6.0725 1.3658 2.6965 1.6924 4.8950 2.1467 1.5606 1.8644 1.3404 1.2658 1.4612 1.9450 1.3688 1.3593 1.0548 1.4212 1.1428 1.8293 1.1588 1.8087 2.0429 2.9764 1.7536 3.4560 1.4415 1.5920 1.3182 1.3791 1.6766 5.5451 4.6935 3.6752 2.0877 3.5019 1.3507 1.1751 2.1176 1.0588 1.0504 1.1526 1.0763 1.0590 2.3226 2.4080 2.5726 7.7780 6.9629 6.1372 6.2398 6.0874 6.3715 1.0582 1.0329 1.0344 1.0821 1.1028 1.1041 1.0977 1.0875 1.0995 1.1048 1.0868 1.0895 1.0895 1.0920 1.0872 1.0957 1.0953 1.1011 1.0949 1.0960 1.0898
irintensity: 0.0899 0.6085 0.3929 0.1821 0.9047 0.9367 0.6875 0.5760 2.9130 0.6875 6.0859 4.9504 0.6464 1.2802 2.4300 2.0730 2.3026 1.3370 0.9066 2.3996 0.8279 3.6203 1.2125 1.5844 0.5501 0.4784 2.2521 4.7166 1.3643 0.6953 3.1714 0.5640 1.1888 0.6860 5.4758 6.5576 3.8797 11.0820 9.4305 34.2655 17.6075 42.9588 43.4435 29.3321 4.6055 11.0646 12.6219 89.3499 89.4811 35.8170 7.0817 17.5159 55.1714 29.2103 33.7792 17.5226 11.9101 19.1870 1.0076 30.4807 21.5537 0.6758 21.6790 8.3641 9.5188 6.9748 3.0221 63.5425 1.9539 5.6124 114.0040 35.4669 2.3580 0.3517 12.1521 0.3089 23.9113 5.9828 8.1659 77.6148 7.4800 0.6738 43.9868 28.1117 9.6051 3.4805 0.2065 105.0796 4.5917 9.4577 6.7227 35.3597 1.6255 179.6293 43.8334 254.5696 44.0659 18.9623 2.4795 2.2395 19.4270 10.0754 12.0466 8.5051 50.3798 2.0299 21.1919 11.1319 7.4492 7.6590 14.2564 55.5636 58.4823 27.4916 2.4010 175.6471 85.2040 25.3263 20.8169 1.0809 27.1701 3.4475 91.9819 28.3671 63.2989 88.8602 5.1495 23.1242 44.7720 30.3593 7.8042 28.4362 17.1003 0.3945 9.3902 8.5676 22.5445 7.3089 30.5211 11.3147 19.1970 6.9814 3.9388 5.4670
temp: 298.150 k
press: 1.00000 atm
elementType: 17 17 17 8 8 8 6 6 6 6 6 6 6 6 6 6 6 6 6 6 6 6 6 6 6 6 6 6 6 1 1 1 1 1 1 1 1 1 1 1 1 1 1 1 1 1 1 1 1 1
symmnumber: 1
zpe: 993205.4 jmol-1
zpe.correction: 0.378292 hartree
zpe.thermalcorrener: 0.406852 hartree
zpe.thermalcorrenthalpy: 0.407796 hartree
zpe.thermalcorrgfe: 0.314318 hartree
zpe.sumelectzpe: -2492.752078 hartree
zpe.sumelectthermal: -2492.723518 hartree
zpe.sumelectthermalent: -2492.722574 hartree
zpe.sumelectthermalfe: -2492.816052 hartree
dipole: 1.6961 2.4957 -0.3488
dipole: 3.0376
quadrupole: -177.9483 -175.5897 -192.6607
quadrupole: -3.3161 -9.8043 -7.6804
quadrupole: 4.1179 6.4765 -10.5945 -3.3161 -9.8043 -7.6804
hfenergy: -2493.1303696 hartree
pointgroup: C01 [X(C23H21Cl3O3)]
dipole: 0.5780807 -0.8474062 -0.6131266 debye
polarizability: 378.1855107|-7.0742771|265.5163526|-11.9101455|8.8120464|253.142164 unknown
InChI: InChI=1S/C23H21Cl3O3/c1-27-19-11-8-17(9-12-19)22(23(24,25)26)18-10-13-20(28-2)21(14-18)29-15-16-6-4-3-5-7-16/h3-14,22H,15H2,1-2H3
charge 0 multiplicity 1
50 atoms
Cl -1.180242 -0.768628 2.909699
Cl -3.504968 0.969538 3.692595
Cl -0.745772 2.166576 3.546284
O  2.600235 0.71002 -0.413792
O  2.257799 2.937481 -2.145826
O  -5.78376 -2.183018 -1.549652
C  -2.173617 1.369628 1.236464
C  -0.928475 1.7485 0.418637
C  -3.09284 0.383328 0.496585
C  -1.902655 0.952987 2.713234
C  0.290616 1.028034 0.447659
C  -1.045079 2.85028 -0.461062
C  1.377001 1.40176 -0.375769
C  -2.583284 -0.72455 -0.21993
C  -4.497233 0.598963 0.489894
C  1.260028 2.529161 -1.245687
C  0.038609 3.233005 -1.278182
C  -3.438912 -1.608796 -0.911218
C  -5.364944 -0.267562 -0.195788
C  -4.837778 -1.380614 -0.897227
C  2.718378 -0.522303 0.389976
C  4.053302 -1.166313 0.075745
C  4.565638 -1.170001 -1.245869
C  4.781018 -1.814927 1.10299
C  3.614704 3.185435 -1.609369
C  5.787962 -1.816553 -1.532623
C  5.998995 -2.471592 0.813811
C  6.5062 -2.47354 -0.505618
C  -5.28917 -3.342417 -2.297448
H  -2.749486 2.308648 1.362956
H  0.397574 0.18301 1.130535
H  -1.982487 3.416246 -0.506101
H  -1.503508 -0.896166 -0.260533
H  -4.916619 1.454328 1.031442
H  -0.035821 4.087475 -1.957705
H  -3.009446 -2.454019 -1.456952
H  -6.446594 -0.104433 -0.205229
H  2.639153 -0.281513 1.469053
H  1.878683 -1.199078 0.121335
H  4.010501 -0.652283 -2.035146
H  4.399486 -1.805895 2.131725
H  4.193806 3.550136 -2.47139
H  3.579478 3.965205 -0.824202
H  4.057745 2.261941 -1.203837
H  6.179589 -1.810005 -2.556045
H  6.553089 -2.970872 1.616412
H  7.45308 -2.976939 -0.730548
H  -4.611869 -3.032731 -3.116898
H  -6.187709 -3.81681 -2.718043
H  -4.7662 -4.056526 -1.632141
