program: Gaussian 09
title: 000184649
version: EM64L-G09RevD.01
frameworkgroup: C1[X(C13H8Cl4O2S)]
method: RPBEPBE
basis: SDD
operation: Freq
keyword: #p
keyword: freq=noraman
keyword: PBEPBE/SDD
title: #p freq=noraman PBEPBE/SDD
converged: YES YES NO NO
title: Mulliken charges:
elementType: Cl Cl Cl Cl S O O C C C C C C C C C C C C C H H H H H H H H
charge: 0.032949 0.032778 -0.024542 -0.036449 0.924906 -0.519104 -0.547283 -0.062869 0.452695 0.440768 -0.116658 -0.248614 -0.321586 -0.350019 -0.730003 -0.356434 -0.308573 -0.104476 -0.195097 -0.215232 0.317549 0.273863 0.277650 0.296414 0.270336 0.284480 0.265331 0.267223
chargesum: 0.00000
title: Mulliken charges with hydrogens summed into heavy atoms:
elementType: Cl Cl Cl Cl S O O C C C C C C C C C C C C C
charge: 0.032949 0.032778 -0.024542 -0.036449 0.924906 -0.519104 -0.547283 -0.062869 0.452695 0.440768 -0.116658 0.068934 -0.321586 -0.076156 0.114396 -0.356434 -0.024093 -0.104476 0.070233 0.051991
polarizability: 3.04228702e+02 1.22650383e+01 2.00791041e+02 4.12058346e+00 -8.74662666e-02 1.44889110e+02
1716.lowfreq: -6.2758 -3.5991 -0.0034 -0.0012 0.0006 2.4527 15.8268 27.8903 56.1967
frequency: 15.8006 27.8499 56.1931 58.3287 61.9300 89.9276 115.2313 125.7241 135.1231 144.2876 174.0903 200.9314 202.9928 214.9774 234.4997 240.6469 266.1474 279.7780 297.2104 310.0770 315.2735 345.9603 372.6146 407.3489 418.6854 451.5593 472.3286 498.4246 514.0846 519.5892 577.0108 590.0768 619.6035 646.2629 708.8958 712.3659 726.0788 754.6812 796.5302 814.9789 824.3790 856.4098 892.9249 894.6229 950.7591 976.5243 984.3604 993.6384 1014.3240 1026.7342 1077.1007 1086.3220 1133.5476 1138.8212 1156.9337 1244.4164 1274.5091 1302.8255 1334.4537 1351.8718 1360.0809 1378.6435 1409.1690 1421.5177 1421.8687 1462.4801 1551.2259 1561.2653 1576.8642 1598.8538 3031.4338 3138.4699 3166.6548 3169.3936 3171.6385 3179.8717 3185.1816 3189.5475
redmass: 13.8670 8.6271 8.2396 8.2008 12.1793 10.0363 5.9267 9.0423 7.6875 1.1736 4.7440 7.9949 20.8704 8.9153 8.4674 6.5133 6.2040 8.0094 10.6778 13.5736 10.3106 7.2619 10.5550 5.1225 5.8970 4.9284 6.3680 6.2875 6.2936 7.0006 8.9620 5.1639 5.8575 7.4846 6.3810 8.2982 5.5721 6.2709 12.6912 1.3451 7.1065 1.3683 1.7277 2.3540 1.3411 1.4571 1.3917 4.5111 1.8896 7.0935 6.8910 1.8970 1.6302 1.8338 1.4260 1.5131 1.8964 1.1397 3.8184 10.5350 8.7512 3.0824 1.0555 1.4279 1.5858 3.4646 8.0399 7.2718 7.2917 8.2581 1.0245 1.0900 1.0890 1.0954 1.0930 1.1071 1.0980 1.1082
irintensity: 0.4731 1.2646 0.2347 3.5941 1.5149 0.8151 2.5883 2.3328 1.2281 0.3476 2.9852 2.5913 0.2948 0.8897 1.4749 0.7082 1.4991 3.4156 1.0976 2.5234 2.8378 17.8798 65.1747 4.7806 9.4543 3.3725 25.8556 5.3836 13.9710 19.7068 26.5656 2.2057 29.0232 26.4013 26.0763 11.9484 16.0420 2.7745 63.0176 41.2169 20.6310 22.5936 19.4932 15.8763 0.0204 40.5819 0.2092 88.4902 34.5925 46.1558 12.1327 48.6630 1.5745 31.0109 4.0925 1.7347 18.3650 7.1511 81.0204 6.4928 10.0505 13.1747 7.6173 52.6534 38.8522 29.4860 5.4116 9.8835 6.3156 2.6498 0.4217 16.0190 0.1811 6.2902 0.1990 0.1398 0.9248 0.6635
temp: 298.150 k
press: 1.00000 atm
elementType: 17 17 17 17 16 8 8 6 6 6 6 6 6 6 6 6 6 6 6 6 1 1 1 1 1 1 1 1
symmnumber: 1
zpe: 454603.3 jmol-1
zpe.correction: 0.173149 hartree
zpe.thermalcorrener: 0.193449 hartree
zpe.thermalcorrenthalpy: 0.194393 hartree
zpe.thermalcorrgfe: 0.121565 hartree
zpe.sumelectzpe: -2887.329680 hartree
zpe.sumelectthermal: -2887.309380 hartree
zpe.sumelectthermalent: -2887.308436 hartree
zpe.sumelectthermalfe: -2887.381265 hartree
dipole: -3.1327 2.7619 3.3190
dipole: 5.3346
quadrupole: -150.0568 -155.4747 -157.3605
quadrupole: -1.1004 19.8947 -0.1641
quadrupole: 4.2406 -1.1774 -3.0632 -1.1004 19.8947 -0.1641
hfenergy: -2887.5028292 hartree
pointgroup: C01 [X(C13H8Cl4O2S1)]
dipole: 1.2894293 -1.6084167 0.3939941 debye
polarizability: 303.0416704|16.5637867|181.235941|4.734659|27.3116731|165.6312415 unknown
InChI: InChI=1S/C13H8Cl4O2S/c1-20(18,19)11-5-3-8(12(16)13(11)17)9-6-7(14)2-4-10(9)15/h2-6H,1H3
charge 0 multiplicity 1
28 atoms
Cl -2.696086 0.758494 2.33631
Cl 0.511407 0.559452 2.523233
Cl 1.819284 -2.945337 -0.548984
Cl 4.996497 2.582527 0.226896
S  -4.261654 0.185489 -0.65648
O  -4.80691 1.631092 -0.147099
O  -4.445915 -0.273389 -2.217049
C  -2.355454 0.032273 -0.351299
C  0.455403 -0.111707 -0.194145
C  1.950678 -0.158111 -0.161475
C  -1.729429 0.318398 0.871695
C  -1.624225 -0.324771 -1.494522
C  -0.316622 0.24292 0.944637
C  -0.221636 -0.396855 -1.407192
C  -5.044382 -1.186804 0.42108
C  2.686289 -1.353976 -0.351365
C  2.683311 1.045879 0.017424
C  4.087861 1.024064 -0.000303
C  4.09529 -1.37251 -0.365469
C  4.811698 -0.169344 -0.190757
H  -2.167793 -0.525065 -2.425098
H  0.366843 -0.670618 -2.287474
H  -4.831303 -0.936286 1.468383
H  -6.116998 -1.138966 0.185903
H  -4.590889 -2.133895 0.09872
H  2.146194 1.98687 0.164795
H  4.629457 -2.315912 -0.506722
H  5.904883 -0.167212 -0.200245
