program: Gaussian 09
title: 000184643
version: EM64L-G09RevD.01
frameworkgroup: C1[X(C13H8Cl4O2S)]
method: RPBEPBE
basis: SDD
operation: Freq
keyword: #p
keyword: freq=noraman
keyword: PBEPBE/SDD
title: #p freq=noraman PBEPBE/SDD
converged: YES YES NO NO
title: Mulliken charges:
elementType: Cl Cl Cl Cl S O O C C C C C C C C C C C C C H H H H H H H H
charge: 0.032028 0.029835 -0.024348 -0.028855 0.924991 -0.519773 -0.547391 -0.063342 0.455397 0.421929 -0.115224 -0.248676 -0.323698 -0.352028 -0.730043 -0.315728 -0.322551 -0.204636 -0.217716 -0.102359 0.317043 0.274085 0.277426 0.296322 0.270548 0.264959 0.285820 0.265987
chargesum: 0.00000
title: Mulliken charges with hydrogens summed into heavy atoms:
elementType: Cl Cl Cl Cl S O O C C C C C C C C C C C C C
charge: 0.032028 0.029835 -0.024348 -0.028855 0.924991 -0.519773 -0.547391 -0.063342 0.455397 0.421929 -0.115224 0.068367 -0.323698 -0.077944 0.114253 -0.315728 -0.057593 0.081184 0.048271 -0.102359
polarizability: 3.29075885e+02 1.07227357e+01 1.89249058e+02 -9.63575643e+00 -6.95160069e+00 1.39127690e+02
1716.lowfreq: -7.7981 -5.2684 -0.2776 0.0012 0.0013 0.0023 20.5084 27.2612 38.3328
frequency: 19.8064 27.1872 38.3165 59.7068 63.3053 116.4602 122.9410 137.0553 144.4778 151.4542 161.3591 181.4272 191.9985 204.5822 223.0886 240.5600 252.0828 267.7752 294.2539 329.0386 347.2087 370.0511 373.8266 408.6387 423.1224 441.6574 464.5600 492.2965 515.8914 532.6365 570.2950 577.2670 617.7199 653.8920 709.0088 719.3623 728.1586 754.4987 794.6708 804.4321 825.3932 858.9213 864.9097 894.6910 956.5921 975.2237 984.4845 990.5880 1015.6742 1030.0360 1075.1864 1084.6046 1137.1399 1141.3929 1157.3674 1243.0056 1286.5860 1304.7921 1329.3286 1349.3521 1356.5002 1377.0267 1409.5443 1419.2238 1422.6287 1470.7542 1550.4428 1561.7154 1576.9988 1596.0220 3032.1957 3138.1584 3155.1140 3169.3024 3180.2358 3181.7972 3185.2570 3190.6734
redmass: 10.6983 9.7918 11.2017 9.2932 10.0950 7.2444 6.1449 12.7002 4.2953 1.2636 6.0049 5.4202 14.1099 23.9027 7.6465 6.8077 9.6164 6.3352 10.0928 8.2602 7.3490 11.5032 10.8182 6.8099 5.6108 4.3252 8.9660 6.7716 4.9698 8.9182 4.2399 7.4754 5.7810 7.5137 5.9382 6.6799 7.3169 5.9635 9.8037 6.9062 1.4616 1.3854 1.4192 3.2010 1.3607 1.8040 1.4854 2.4747 1.8424 4.9743 5.2618 2.3677 2.0518 1.4868 1.4161 1.4135 2.1796 1.1431 3.6172 5.9455 8.2317 4.4991 1.0572 2.4525 1.0553 3.3135 8.4461 8.5504 7.1729 7.6068 1.0245 1.0900 1.0897 1.0954 1.1071 1.0961 1.0944 1.1081
irintensity: 1.1232 1.4506 0.3192 3.5613 1.7627 2.9249 0.5490 0.5259 1.8362 0.4343 0.3009 3.1330 1.8626 0.2365 0.3856 0.7478 5.0446 1.8054 2.9339 7.7926 19.0736 41.0442 24.4684 13.8330 0.6126 3.5091 13.4270 4.7834 2.1332 20.9848 18.4827 39.5173 36.3544 3.8076 6.7406 19.9077 15.1553 1.9009 82.3569 72.0576 26.8570 21.9869 19.0530 28.4248 0.1722 49.5591 0.5713 22.7983 39.9677 53.3123 27.9578 52.5961 19.3276 4.4701 7.9894 0.7212 12.9759 6.3087 60.2721 25.0198 12.4722 9.9549 7.2966 64.4606 13.9873 54.0814 4.6421 24.6056 1.3805 67.6107 0.4224 15.6841 2.4959 6.4779 0.1492 0.2986 1.6627 0.6826
temp: 298.150 k
press: 1.00000 atm
elementType: 17 17 17 17 16 8 8 6 6 6 6 6 6 6 6 6 6 6 6 6 1 1 1 1 1 1 1 1
symmnumber: 1
zpe: 454610.4 jmol-1
zpe.correction: 0.173152 hartree
zpe.thermalcorrener: 0.193433 hartree
zpe.thermalcorrenthalpy: 0.194377 hartree
zpe.thermalcorrgfe: 0.121672 hartree
zpe.sumelectzpe: -2887.329907 hartree
zpe.sumelectthermal: -2887.309626 hartree
zpe.sumelectthermalent: -2887.308682 hartree
zpe.sumelectthermalfe: -2887.381387 hartree
dipole: 2.5999 -0.2653 2.6032
dipole: 3.6887
quadrupole: -165.9832 -154.2819 -151.6733
quadrupole: -0.2404 -25.3452 -4.3086
quadrupole: -8.6704 3.0309 5.6395 -0.2404 -25.3452 -4.3086
hfenergy: -2887.5030589 hartree
pointgroup: C01 [X(C13H8Cl4O2S1)]
dipole: 1.0279628 -0.2776309 -0.9860705 debye
polarizability: 329.338613|-2.4437108|176.4539674|13.2420719|-22.4901404|151.6600525 unknown
InChI: InChI=1S/C13H8Cl4O2S/c1-20(18,19)11-5-4-9(12(16)13(11)17)8-3-2-7(14)6-10(8)15/h2-6H,1H3
charge 0 multiplicity 1
28 atoms
Cl -2.81655 -2.436534 0.167712
Cl 0.397077 -2.60815 0.153614
Cl 1.942926 1.180426 -2.475607
Cl 6.509015 0.154308 0.469288
S  -4.352914 0.623153 0.161694
O  -4.991608 -0.185374 1.420828
O  -4.517451 2.247547 0.044442
C  -2.440555 0.341994 0.075107
C  0.376255 0.191463 0.093801
C  1.870006 0.153066 0.147329
C  -1.828994 -0.920161 0.128794
C  -1.691494 1.527866 0.027707
C  -0.414232 -0.988819 0.136398
C  -0.28694 1.443954 0.034756
C  -5.032927 -0.12143 -1.462543
C  2.690169 0.607486 -0.914518
C  2.526248 -0.307409 1.320597
C  4.097324 0.61347 -0.838355
C  3.930669 -0.312374 1.435656
C  4.696346 0.151599 0.348113
H  -2.22366 2.485829 -0.00041
H  0.314053 2.357142 0.002093
H  -4.822941 -1.198499 -1.436802
H  -6.109286 0.09924 -1.434115
H  -4.523741 0.401833 -2.283166
H  1.918941 -0.663378 2.158614
H  4.700792 0.962349 -1.679368
H  4.415868 -0.6668 2.34864
