program: Gaussian 09
title: 000184737
version: EM64L-G09RevD.01
frameworkgroup: C1[X(C15H22N2O18P2)]
method: RPBEPBE
basis: SDD
operation: Freq
keyword: #p
keyword: freq=noraman
keyword: PBEPBE/SDD
title: #p freq=noraman PBEPBE/SDD
converged: NO YES NO NO
title: Mulliken charges:
elementType: P P O O O O O O O O O O O O O O O O O O N N C C C C C C C C C C C C C C C H H H H H H H H H H H H H H H H H H H H H H
charge: 1.496038 1.499065 -0.262583 -0.242795 -0.584279 -0.494176 -0.606576 -0.510044 -0.497841 -0.475853 -0.434259 -0.773723 -0.407947 -0.692010 -0.371960 -0.643621 -0.206413 -0.576345 -0.646807 -0.227982 -0.221589 -0.406449 -0.063585 -0.253010 -0.048159 -0.046617 -0.147717 -0.075651 -0.127665 -0.324661 -0.080555 -0.150156 0.351258 -0.040260 0.173441 -0.309838 0.144597 0.346805 0.333245 0.274188 0.287178 0.249241 0.291654 0.278299 0.250363 0.265214 0.263080 0.280062 0.417563 0.380441 0.285754 0.392004 0.373875 0.378816 0.401485 0.260344 0.385185 0.469652 0.422278
chargesum: 0.00000
title: Mulliken charges with hydrogens summed into heavy atoms:
elementType: P P O O O O O O O O O O O O O O O O O O N N C C C C C C C C C C C C C C C
charge: 1.496038 1.499065 -0.262583 -0.242795 -0.166716 -0.113735 -0.606576 -0.510044 -0.105838 -0.101977 -0.055444 -0.773723 -0.022762 -0.222358 -0.371960 -0.221343 -0.206413 -0.576345 -0.646807 -0.227982 -0.221589 -0.004964 0.283220 0.080235 0.226029 0.240561 0.101524 0.216003 0.150635 0.190915 0.182525 0.129907 0.351258 0.245494 0.173441 -0.049493 0.144597
polarizability: 2.94142124e+02 -6.49376246e+00 2.85963583e+02 2.89566396e+00 -2.54836894e+01 2.61464571e+02
1716.lowfreq: -4.6506 0.0004 0.0007 0.0013 4.8054 7.7130 24.0219 29.1627 34.4711
frequency: 23.9541 29.1194 34.4413 37.6902 43.2556 55.4310 61.0554 65.4796 68.0903 81.2896 84.1340 102.8279 105.4547 116.2059 122.8951 143.0638 149.0494 154.3427 156.2091 162.4029 168.1002 186.5079 194.6474 197.5657 208.6582 212.8175 219.1463 233.5465 233.9528 252.6097 255.8066 265.2683 271.2687 292.7232 303.3110 311.4576 319.8358 325.6451 333.7575 343.1610 356.1866 357.1090 365.6230 370.2325 383.7537 391.7536 394.7072 399.8096 416.1773 420.0672 430.3087 446.7774 453.2979 481.2006 514.3191 529.6743 532.6969 539.5590 548.2019 555.8574 570.2462 591.9937 610.1911 615.6937 624.3298 663.8261 674.7232 680.9250 697.7418 706.7310 707.5932 712.4780 714.6777 731.0436 748.9283 756.4496 766.0825 780.4868 800.2316 808.7985 818.5513 852.2355 867.2570 878.2450 879.2914 899.1046 900.9795 910.9749 940.2182 945.5153 954.5989 960.6528 964.2129 970.7836 979.8824 983.7393 996.9627 1002.8756 1024.6249 1028.2804 1049.6991 1053.1789 1057.2687 1075.2280 1079.6473 1083.9466 1086.7211 1091.2043 1101.9317 1103.1606 1118.3616 1121.6315 1173.2240 1183.2870 1189.0667 1225.8784 1226.9185 1239.7277 1243.7615 1244.9970 1252.0330 1260.7232 1272.0809 1273.1791 1284.4942 1297.9595 1300.3288 1317.2186 1321.4779 1323.6862 1344.5648 1347.0010 1365.3524 1367.4966 1369.8015 1372.8818 1381.7041 1386.6290 1388.8342 1397.3695 1402.2630 1415.0100 1429.0597 1433.7375 1472.3306 1610.4584 1614.5105 1675.2581 1678.5298 2292.7963 3008.7200 3023.8574 3024.1730 3046.3271 3051.9503 3054.4442 3065.8311 3065.9518 3074.4919 3104.6224 3106.9875 3187.7378 3194.0692 3215.1514 3249.2655 3322.9731 3410.3675 3507.5799 3569.1346 3582.8435 3616.5757
redmass: 8.2855 7.7428 8.9766 6.8560 8.3795 8.4725 7.1102 7.4320 10.3248 8.9435 6.6828 7.5638 7.8564 8.5533 8.9768 8.2643 7.8825 7.3755 5.3448 7.1756 5.3034 7.1330 6.0379 8.4020 6.6869 6.9251 4.8960 5.6917 4.6354 4.4274 7.3714 5.5520 6.2964 4.8402 4.9290 2.3985 8.8626 2.1568 2.2890 5.0158 3.6438 5.2319 3.6169 3.7761 6.4964 4.6542 5.3187 6.2075 10.1113 3.9575 5.5426 4.7905 6.4428 6.6237 4.9779 7.4335 6.8664 4.7529 7.4091 5.2431 1.9367 1.9237 1.5650 5.3975 4.1103 5.4546 1.6224 3.2991 3.4137 3.8148 3.4640 1.9817 2.7427 5.4609 5.9711 5.4188 4.5367 15.1940 2.4067 2.2204 3.5016 9.8168 1.5417 4.1730 3.9331 4.4302 3.1759 5.7737 7.0941 7.6682 1.5189 2.9220 3.9700 3.9857 2.0606 1.5265 4.9082 2.6770 2.7273 3.5239 3.9303 3.8572 4.3646 3.0875 2.5064 3.6459 4.0168 2.9618 3.1998 2.4799 2.7547 2.7869 1.2061 1.1315 1.1260 2.0710 1.4326 1.5717 1.2976 1.2834 1.2663 1.1806 1.2814 1.3283 1.7581 1.1688 1.3556 1.3651 1.3279 1.3127 1.3949 1.2983 1.7700 1.3118 1.7712 1.6939 1.2992 1.4572 1.3930 1.8485 1.8060 1.2074 1.3643 1.0893 1.0812 3.5833 8.6228 5.8217 7.9281 1.0847 1.0843 1.0820 1.0597 1.0848 1.0871 1.0889 1.0874 1.0882 1.0886 1.0896 1.1091 1.0897 1.0711 1.0992 1.0706 1.0783 1.0645 1.0639 1.0661 1.0664 1.0674
irintensity: 0.1418 3.9816 1.4667 1.2270 3.4206 0.9541 5.1373 0.7063 0.9875 1.2482 2.1232 14.1319 1.3971 0.3784 1.4138 4.9078 0.4518 5.3845 29.2989 3.8627 19.7346 6.9341 10.6789 9.0041 1.4664 21.9043 4.3849 2.3499 5.8839 25.7503 1.9970 31.2370 6.1798 23.2249 26.5762 22.6626 13.4390 37.9801 18.0162 15.1008 62.0011 51.3608 35.9466 37.9512 34.6361 11.7314 18.1715 35.4834 17.1701 27.9075 81.4827 43.4869 16.0710 12.6888 20.2215 52.7931 91.4663 34.2407 17.1184 80.5058 88.7924 54.4092 62.9365 16.4542 41.7866 43.3159 173.9563 21.1836 193.5681 46.4374 194.1998 102.2134 51.6439 12.1242 24.0068 55.8760 94.4481 440.0349 36.8040 6.9070 33.6467 97.4938 182.8596 16.9007 17.9788 45.3196 73.1804 29.0068 110.8120 29.6097 14.9578 37.9734 160.5708 318.2234 44.2120 108.7854 266.5804 99.5414 120.1942 64.6878 80.2923 119.1175 34.1585 39.3509 27.4338 169.9752 92.9011 61.7707 25.1472 91.3536 6.2183 41.9008 13.5453 11.9777 20.3662 36.7622 16.1280 4.5030 30.6789 12.4513 99.7377 14.5309 25.5851 72.4510 36.8184 6.3650 3.5981 14.3176 15.4920 1.9219 7.5671 8.6208 84.0534 8.6511 6.1140 81.8975 4.6398 24.1802 19.4422 30.0020 16.4995 42.2208 111.4465 141.6708 10.7063 234.4861 134.1479 285.5547 477.7885 2300.6476 4.7751 14.9375 15.7446 3.2268 18.0842 8.7652 14.3051 23.0897 20.3859 16.6974 9.6759 4.1550 489.6528 0.0877 205.0702 422.6758 153.6255 29.0790 134.3560 26.1193 45.5115
temp: 298.150 k
press: 1.00000 atm
elementType: 15 15 8 8 8 8 8 8 8 8 8 8 8 8 8 8 8 8 8 8 7 7 6 6 6 6 6 6 6 6 6 6 6 6 6 6 6 1 1 1 1 1 1 1 1 1 1 1 1 1 1 1 1 1 1 1 1 1 1
symmnumber: 1
zpe: 1085110.5 jmol-1
zpe.correction: 0.413297 hartree
zpe.thermalcorrener: 0.450382 hartree
zpe.thermalcorrenthalpy: 0.451326 hartree
zpe.thermalcorrgfe: 0.344922 hartree
zpe.sumelectzpe: -2727.920835 hartree
zpe.sumelectthermal: -2727.883750 hartree
zpe.sumelectthermalent: -2727.882806 hartree
zpe.sumelectthermalfe: -2727.989210 hartree
dipole: 5.0387 1.6782 7.3685
dipole: 9.0829
quadrupole: -215.7199 -255.2854 -226.4625
quadrupole: 16.9071 -14.4408 21.7377
quadrupole: 16.7694 -22.7961 6.0268 16.9071 -14.4408 21.7377
hfenergy: -2728.3341319 hartree
pointgroup: C01 [X(C15H22N2O18P2)]
dipole: 2.4993121 -0.7803112 -2.4319701 debye
polarizability: 288.9105613|12.9424298|276.4977495|4.5585444|-27.3505266|276.1619668 unknown
InChI: InChI=1S/C15H22N2O18P2/c18-5-1-2-17(15(26)16-5)12-9(22)6(19)4(32-12)3-31-36(27,28)35-37(29,30)34-11-8(21)7(20)10(13(23)24)33-14(11)25/h1-2,4,6-12,14,16,19-23,25,27,29H,3H2
charge 0 multiplicity 1
59 atoms
P  -0.345481 3.724974 -1.352428
P  0.95376 3.191094 1.489495
O  3.960956 -0.640852 -0.214846
O  -4.168919 0.786053 -0.945872
O  2.258484 1.516179 -2.476059
O  3.187315 -0.770169 -3.103893
O  -0.613921 2.03834 -1.073406
O  2.403725 2.610967 0.763311
O  -0.356472 -0.150956 0.648581
O  -2.296047 -2.340397 0.047536
O  -2.632644 1.097962 -2.793139
O  0.292984 4.175603 0.260623
O  -5.78334 -2.004541 -1.358624
O  0.967696 3.648798 -2.349619
O  0.250709 -2.593413 -0.97341
O  1.407686 4.407987 2.582993
O  -5.532675 -1.26961 0.83385
O  -1.563924 4.65837 -1.710032
O  0.054521 2.054571 2.142108
O  0.122438 -3.679792 3.558712
N  2.217765 -2.234445 0.30028
N  0.244876 -3.08164 1.300223
C  2.17822 0.561311 -1.372817
C  2.308487 -0.888495 -1.923909
C  3.350849 0.715792 -0.367967
C  3.067025 -1.641432 -0.802479
C  -1.449736 -0.034218 -0.307501
C  -1.850723 1.436008 -0.533251
C  -2.654773 -0.91768 0.096947
C  2.904392 1.228158 1.013271
C  -3.843749 -0.667363 -0.864974
C  -3.052554 1.568107 -1.492772
C  0.867267 -2.626606 0.14721
C  2.879432 -2.45394 1.5227
C  -5.117275 -1.322095 -0.339326
C  2.254245 -2.964227 2.627207
C  0.823966 -3.276771 2.592327
H  1.199883 0.700607 -0.888695
H  1.344527 -1.351232 -2.174975
H  4.133863 1.373057 -0.780536
H  3.720011 -2.431286 -1.212026
H  -1.058492 -0.415406 -1.270172
H  -2.122752 1.920133 0.425436
H  -2.968422 -0.705716 1.134066
H  3.757521 1.299845 1.707283
H  2.108913 0.593888 1.443498
H  -3.608745 -1.050324 -1.874174
H  -3.441276 2.601522 -1.524253
H  2.761834 1.079926 -3.220949
H  2.997265 -1.491518 -3.750719
H  3.930717 -2.159517 1.52998
H  -0.373797 0.596549 1.327378
H  -1.572621 -2.482968 -0.639608
H  -3.279184 1.396047 -3.480589
H  -0.788149 -3.149936 1.226402
H  2.794547 -3.120632 3.561365
H  -6.60924 -2.424758 -0.992397
H  1.532014 2.741132 -2.424495
H  1.335417 5.327255 2.213532
