program: Gaussian 09
title: 000184651
version: EM64L-G09RevD.01
frameworkgroup: C1[X(C13H8Cl4O2S)]
method: RPBEPBE
basis: SDD
operation: Freq
keyword: #p
keyword: freq=noraman
keyword: PBEPBE/SDD
title: #p freq=noraman PBEPBE/SDD
converged: YES YES NO NO
title: Mulliken charges:
elementType: Cl Cl Cl Cl S O O C C C C C C C C C C C C C H H H H H H H H
charge: 0.080463 0.021250 -0.025246 -0.021509 0.888076 -0.520126 -0.531818 -0.189752 0.438400 0.399828 -0.168604 -0.345890 -0.739074 -0.114654 -0.214537 -0.367466 -0.299147 -0.130013 -0.206914 -0.215401 0.274074 0.285111 0.277318 0.298318 0.270543 0.320703 0.267604 0.268462
chargesum: 0.00000
title: Mulliken charges with hydrogens summed into heavy atoms:
elementType: Cl Cl Cl Cl S O O C C C C C C C C C C C C C
charge: 0.080463 0.021250 -0.025246 -0.021509 0.888076 -0.520126 -0.531818 -0.189752 0.438400 0.399828 -0.168604 -0.071817 0.121673 -0.114654 0.056006 -0.367466 0.021556 -0.130013 0.060691 0.053061
polarizability: 2.89097999e+02 -9.65703094e+00 2.01574328e+02 2.63592871e+00 6.22833676e+00 1.52341818e+02
1716.lowfreq: -9.2950 -1.0422 -0.0013 0.0011 0.0017 6.1794 25.0796 31.5106 38.3569
frequency: 25.0491 31.4600 38.3261 57.6102 60.9655 89.7988 123.5768 131.3373 136.5856 154.1363 174.1802 181.6113 200.3611 218.2878 235.6943 260.8486 265.8968 275.4676 301.2841 307.7580 313.4545 336.3911 367.0563 397.7014 417.9829 441.0390 465.3053 501.5783 507.8462 526.9879 567.1074 587.3505 607.2002 650.1631 693.5148 713.6155 725.7079 738.9885 795.6406 815.0237 823.4095 831.9223 881.6607 891.0032 949.0486 961.0659 968.1261 992.7127 994.0724 1014.8609 1070.9376 1088.6623 1133.5746 1147.5782 1162.1143 1246.4717 1278.2256 1293.6077 1312.5393 1346.1276 1354.6875 1375.8207 1407.1740 1417.6429 1421.4579 1460.6899 1533.4786 1555.7552 1577.7588 1592.2226 3033.8793 3159.9375 3165.5774 3174.7109 3180.7406 3182.8832 3185.0271 3206.5959
redmass: 11.4181 11.3405 6.9987 17.0498 6.8389 9.5478 2.2816 2.9166 6.0318 11.9698 8.5159 4.9688 4.4236 14.1926 7.8648 4.6301 8.7664 5.8093 8.0589 9.7266 15.0489 6.8583 9.1756 6.0179 6.0414 6.3478 3.9509 4.9247 8.2449 9.1334 8.6157 5.4123 5.5708 7.6370 7.2923 6.5183 6.0465 5.6486 12.8576 1.3418 3.1130 1.8486 1.7445 2.1123 1.3401 1.3729 1.4019 5.6843 2.0907 7.0800 7.8360 1.8783 1.4440 1.4798 2.2798 1.7212 1.7337 1.1447 3.3679 6.8489 7.6996 3.2590 1.0540 1.0599 2.7564 3.2933 6.9982 6.6804 7.3990 8.1160 1.0249 1.0890 1.0891 1.1070 1.0977 1.0955 1.0958 1.1078
irintensity: 0.7589 0.2779 3.9867 1.8053 0.3602 0.9512 0.9229 0.1678 0.4174 1.3021 1.5582 2.6579 0.6357 1.0700 0.7609 2.3590 1.2965 4.2927 3.0911 4.4437 3.1208 15.4549 35.7599 30.1332 2.9909 6.8923 14.9288 5.6776 24.3005 14.5816 34.0796 6.3623 13.1022 0.6856 5.9613 1.6612 16.3147 1.9414 43.9735 40.1778 39.3291 19.0013 32.1804 7.3346 0.0641 0.6404 22.7525 26.6843 69.3564 74.9079 31.4416 39.2491 6.8979 31.6369 35.3691 1.0780 5.5280 2.6640 21.6266 5.3120 2.2918 22.2614 23.1237 14.8520 141.9081 29.1485 7.0228 12.0592 5.2002 5.4936 0.0282 1.4137 0.1413 0.0418 0.8169 0.7445 3.4451 1.4517
temp: 298.150 k
press: 1.00000 atm
elementType: 17 17 17 17 16 8 8 6 6 6 6 6 6 6 6 6 6 6 6 6 1 1 1 1 1 1 1 1
symmnumber: 1
zpe: 453466.3 jmol-1
zpe.correction: 0.172716 hartree
zpe.thermalcorrener: 0.193072 hartree
zpe.thermalcorrenthalpy: 0.194016 hartree
zpe.thermalcorrgfe: 0.121493 hartree
zpe.sumelectzpe: -2887.317062 hartree
zpe.sumelectthermal: -2887.296707 hartree
zpe.sumelectthermalent: -2887.295762 hartree
zpe.sumelectthermalfe: -2887.368285 hartree
dipole: 3.5886 6.1520 0.6075
dipole: 7.1480
quadrupole: -147.2428 -161.9190 -149.2421
quadrupole: -1.3111 10.7894 -2.6371
quadrupole: 5.5585 -9.1177 3.5592 -1.3111 10.7894 -2.6371
hfenergy: -2887.4897785 hartree
pointgroup: C01 [X(C13H8Cl4O2S1)]
dipole: 1.4470567 -1.6729096 -1.7366829 debye
polarizability: 284.2089224|24.5451635|183.4931884|-11.246745|23.0131451|175.3120349 unknown
InChI: InChI=1S/C13H8Cl4O2S/c1-20(18,19)13-8(3-5-11(16)12(13)17)9-6-7(14)2-4-10(9)15/h2-6H,1H3
charge 0 multiplicity 1
28 atoms
Cl -4.001138 0.942696 1.423397
Cl -4.830487 -2.110288 0.8681
Cl 0.639362 -0.988858 -3.04334
Cl 4.123637 0.602907 2.109671
S  -0.987666 2.135398 0.451526
O  -2.302772 3.076569 0.266529
O  -0.027464 2.31567 1.760496
C  -1.487531 0.231374 0.334804
C  -0.51096 -0.700773 -0.104022
C  0.944038 -0.399404 -0.302027
C  -2.799722 -0.171166 0.678117
C  -0.919493 -2.048902 -0.286901
C  0.033408 2.483694 -1.143838
C  -3.166493 -1.52491 0.47652
C  -2.235771 -2.457208 -0.017778
C  1.602234 -0.582606 -1.545537
C  1.740559 -0.026722 0.816688
C  3.129009 0.139575 0.664443
C  2.990972 -0.407745 -1.695301
C  3.771642 -0.046399 -0.57532
H  -0.184089 -2.782516 -0.628938
H  1.07091 2.185525 -0.960495
H  -0.441191 1.929039 -1.965123
H  -0.086857 3.570514 -1.257915
H  -2.539352 -3.497316 -0.163166
H  1.26604 0.134194 1.787418
H  3.460185 -0.547438 -2.672814
H  4.852288 0.088095 -0.672494
