program: Gaussian 09
title: 000184626
version: EM64L-G09RevD.01
frameworkgroup: C1[X(C12H18O3)]
method: RPBEPBE
basis: SDD
operation: Freq
keyword: #pfreq=noraman
keyword: PBEPBE/SDD
title: #p freq=noraman PBEPBE/SDD
converged: YES YES NO NO
title: Mulliken charges:
elementType: O O O C C C C C C C C C C C C H H H H H H H H H H H H H H H H H H
charge: -0.272167 -0.218111 -0.247015 0.228808 -0.463142 -0.488892 -0.199427 0.256757 0.240171 -0.752658 -0.752062 -0.841216 -0.252100 0.302590 -0.757804 0.212094 0.222862 0.227022 0.217539 0.282602 0.262390 0.210218 0.212021 0.211893 0.265728 0.206379 0.264408 0.233033 0.249139 0.186606 0.249544 0.254173 0.248616
chargesum: 0.00000
title: Mulliken charges with hydrogens summed into heavy atoms:
elementType: O O O C C C C C C C C C C C C
charge: -0.272167 -0.218111 -0.247015 0.228808 -0.028186 -0.044330 0.083175 0.256757 0.240171 -0.068029 -0.068061 -0.094636 -0.065494 0.302590 -0.005471
polarizability: 1.92587659e+02 3.46619963e+00 1.25448153e+02 -5.88950408e+00 -2.07215126e+00 1.09293564e+02
1716.lowfreq: -44.8015 -18.6032 -3.2769 -0.0011 -0.0009 -0.0008 10.0255 24.6150 44.9761
frequency: -44.7613 24.5111 44.4971 63.7216 96.0240 105.9727 147.9082 168.5419 199.4300 204.4237 222.9641 238.5803 248.6137 264.1804 297.9806 324.9257 340.8712 359.5363 393.8172 403.1238 455.3232 477.9124 495.8766 560.2082 575.6612 608.7077 625.9327 643.5347 660.1493 801.8991 822.3537 858.3328 882.8357 900.9184 932.5916 952.0523 956.4217 986.9145 995.9707 1002.4433 1021.8007 1031.1133 1044.8336 1054.8968 1090.6976 1120.1157 1147.2168 1180.0753 1187.0662 1200.9893 1217.4406 1238.7152 1301.3628 1310.7565 1342.3022 1348.1913 1369.3092 1375.0251 1383.5370 1390.1544 1391.9879 1406.2777 1454.3390 1455.0286 1457.1952 1458.1006 1467.8679 1468.8214 1476.9909 1483.5808 1490.7964 1498.9733 1581.0062 1608.2272 1638.0942 2919.5980 2976.0503 2978.6739 2983.1662 2988.0878 2992.3334 3007.5816 3008.4292 3046.6443 3057.8463 3063.4873 3067.0644 3068.9757 3096.3327 3098.2565 3099.6113 3112.0688 3140.7900
redmass: 1.0698 7.5370 3.6307 3.2664 2.9868 1.1453 3.3364 2.8326 1.3704 5.1990 3.4679 2.4903 1.4902 1.4662 3.0939 3.0079 2.4986 2.9486 2.9283 2.4252 3.2048 3.1188 3.3622 3.8276 3.6960 3.8136 3.8336 4.6217 3.1529 3.8708 2.2595 3.0135 3.4581 2.3161 1.5630 2.1136 1.9342 1.4783 1.8381 1.6097 1.5532 1.6150 1.6255 2.1578 1.7147 2.2323 2.3917 2.3465 3.3106 2.1079 1.7254 2.1363 1.2663 2.6057 1.3978 1.8032 1.1908 1.6529 1.2206 1.2137 1.2543 1.2096 1.0664 1.0665 1.0670 1.0546 1.0708 1.0745 1.0689 1.0549 1.0706 1.0627 6.7632 6.3725 10.3869 1.0836 1.0371 1.0377 1.0411 1.0587 1.0671 1.0797 1.0367 1.1004 1.1008 1.0997 1.0926 1.0985 1.0972 1.0995 1.0986 1.0981 1.1012
irintensity: 1.5243 3.5102 1.3663 0.9322 2.0547 0.8009 7.0068 1.2131 2.0910 9.7268 10.7078 0.8222 0.2323 2.0102 0.8921 0.5102 2.2617 1.4494 0.7357 1.9484 0.7300 7.7045 4.2975 2.8663 6.2157 1.7475 1.5814 16.7158 7.3689 12.0979 9.2524 22.7676 53.8623 29.4919 2.8976 45.7641 12.9061 7.9705 49.2454 10.9144 4.3704 15.4059 6.0942 10.0630 10.1471 18.4796 125.3480 31.7025 295.5112 21.0469 7.9983 3.9667 8.0553 29.1122 5.1202 4.3491 23.2686 4.3360 51.8223 42.4207 15.2989 17.5025 2.3904 14.5211 21.1117 3.5838 12.0144 2.2655 31.7921 8.2761 9.3407 18.9407 190.5088 56.5416 199.3601 91.2870 31.6827 24.5417 16.5532 36.8846 20.4400 17.9651 4.3432 25.6230 26.9133 31.3053 14.9394 57.4528 5.7869 10.7176 8.1090 12.1209 7.7824
temp: 298.150 k
press: 1.00000 atm
elementType: 8 8 8 6 6 6 6 6 6 6 6 6 6 6 6 1 1 1 1 1 1 1 1 1 1 1 1 1 1 1 1 1 1
symmnumber: 1
zpe: 722206.8 jmol-1
zpe.correction: 0.275074 hartree
zpe.thermalcorrener: 0.291087 hartree
zpe.thermalcorrenthalpy: 0.292031 hartree
zpe.thermalcorrgfe: 0.231467 hartree
zpe.sumelectzpe: -692.570894 hartree
zpe.sumelectthermal: -692.554881 hartree
zpe.sumelectthermalent: -692.553937 hartree
zpe.sumelectthermalfe: -692.614501 hartree
dipole: 2.5922 -1.1890 0.5442
dipole: 2.9033
quadrupole: -107.2149 -86.0851 -90.3252
quadrupole: 3.4204 11.0881 0.3988
quadrupole: -12.6732 8.4566 4.2165 3.4204 11.0881 0.3988
hfenergy: -692.8459682 hartree
pointgroup: C01 [X(C12H18O3)]
dipole: 1.0689839 -0.3336793 0.2251072 debye
polarizability: 190.3051467|13.679133|128.3413999|-0.4859986|-0.2083979|108.6828289 unknown
InChI: InChI=1S/C12H18O3/c1-8-10(7-13)12(3,4)6-5-11(8)15-9(2)14/h7,11H,5-6H2,1-4H3
charge 0 multiplicity 1
33 atoms
O  1.957366 -0.100683 0.528296
O  -3.73693 0.971379 0.441362
O  3.649608 1.050543 -0.608908
C  -1.693987 -1.150125 -0.04118
C  -0.371084 -1.962008 -0.164213
C  0.623422 -1.322973 -1.145695
C  1.017111 0.070078 -0.65451
C  -1.396388 0.362882 0.052115
C  -0.146605 0.917339 -0.166609
C  -2.609237 -1.427612 -1.273624
C  -2.419824 -1.635125 1.250186
C  0.205043 2.393719 -0.008693
C  -2.516551 1.29421 0.343879
C  3.253846 0.418691 0.398194
C  4.078564 0.111904 1.629675
H  -0.619971 -2.99403 -0.475171
H  0.112317 -2.026875 0.830195
H  1.533402 -1.939817 -1.25815
H  0.173077 -1.223574 -2.152674
H  1.589407 0.627777 -1.421848
H  -3.550826 -0.859877 -1.194221
H  -2.114515 -1.150244 -2.222809
H  -2.857039 -2.50486 -1.317739
H  -1.829562 -1.387457 2.152189
H  -3.417847 -1.180032 1.345719
H  -2.534932 -2.735071 1.210893
H  1.299914 2.512589 0.051969
H  -0.231012 2.852792 0.893671
H  -0.130604 2.98468 -0.883085
H  -2.234894 2.366876 0.455694
H  4.964067 -0.478754 1.336821
H  3.492706 -0.441866 2.376717
H  4.447356 1.055626 2.067554
