program: Gaussian 09
title: 000184624
version: EM64L-G09RevD.01
frameworkgroup: C1[X(C12H16O3)]
method: RPBEPBE
basis: SDD
operation: Freq
keyword: #pfreq=noraman
keyword: PBEPBE/SDD
title: #p freq=noraman PBEPBE/SDD
converged: YES YES NO NO
title: Mulliken charges:
elementType: O O O C C C C C C C C C C C C H H H H H H H H H H H H H H H H
charge: -0.269188 -0.211746 -0.251828 0.115745 0.460877 -0.439222 -0.203452 0.421557 -0.725235 -0.721850 -0.431971 -0.822587 -0.240328 0.312895 -0.759812 0.237912 0.255077 0.221975 0.209716 0.265075 0.226493 0.262647 0.209782 0.257293 0.243865 0.221988 0.228300 0.174872 0.248626 0.253436 0.249090
chargesum: 0.00000
title: Mulliken charges with hydrogens summed into heavy atoms:
elementType: O O O C C C C C C C C C C C C
charge: -0.269188 -0.211746 -0.251828 0.115745 0.460877 -0.201310 0.051625 0.421557 -0.028469 -0.022927 -0.174678 -0.128434 -0.065457 0.312895 -0.008661
polarizability: 1.98166682e+02 -4.13517499e-01 1.28862888e+02 8.56060787e+00 3.12387509e+00 1.01449683e+02
1716.lowfreq: -31.0806 -11.8444 -7.0620 -0.0008 -0.0007 -0.0004 7.8518 28.2896 35.9913
frequency: -31.0313 28.1408 35.9192 68.6915 108.0791 124.3696 165.1376 172.7910 191.8795 205.3319 213.5044 239.3710 255.6278 261.9031 276.6835 311.3816 337.3337 371.6450 386.0795 441.5463 459.0640 520.5822 556.7198 573.4186 583.8892 613.0534 644.9294 656.3121 735.6902 800.7674 849.7752 873.2169 881.5976 916.9238 923.5133 935.9631 957.9366 987.3771 996.2747 1014.2273 1027.5093 1045.2113 1048.6902 1083.2519 1124.6858 1131.6838 1173.9894 1185.6335 1209.0921 1252.6818 1289.4073 1303.3890 1363.7277 1367.7216 1382.8393 1385.1413 1390.8704 1396.6017 1409.2786 1454.7242 1457.7812 1459.3298 1461.0638 1475.2092 1475.4505 1479.8796 1493.5065 1601.4672 1633.9618 1637.5606 1694.5371 2863.7316 2969.7864 2981.6721 2982.9760 2984.5084 3008.5108 3047.4955 3075.8891 3080.7378 3088.3104 3093.3053 3097.0196 3101.7395 3104.1941 3105.3383 3139.9861
redmass: 1.0873 5.3208 4.3986 3.6849 3.8502 2.3182 2.5339 1.4034 5.1920 3.0740 2.0369 2.4642 1.6955 1.0533 2.8614 3.0783 3.6317 3.5370 3.4007 2.7687 3.3150 3.7539 4.1294 3.5837 3.9433 4.9544 4.4165 4.5426 3.6523 4.0005 4.6153 1.5281 2.3589 1.9856 1.8002 1.5527 2.0085 1.7325 1.8073 1.3234 1.6855 1.6293 1.5177 2.3772 3.6343 1.9752 2.2900 3.1697 2.7142 1.8927 1.2673 1.4271 1.9869 1.1753 1.3093 1.4740 1.5779 1.3137 1.3648 1.0668 1.0473 1.0473 1.0471 1.0548 1.0578 1.0721 1.0741 7.5972 10.3491 7.7442 7.6557 1.0850 1.0385 1.0354 1.0815 1.0350 1.0364 1.0952 1.0999 1.0993 1.0985 1.0910 1.0973 1.1010 1.0901 1.1001 1.1012
irintensity: 1.7711 1.2147 1.3651 0.9792 1.9271 3.5242 6.2355 1.7151 7.9337 4.6998 8.2776 2.6858 1.9250 0.1961 0.5272 3.5712 1.2858 1.1555 0.3536 1.4529 3.6617 2.9951 2.8444 0.7038 3.9985 4.2742 13.2672 8.3239 20.6865 42.4781 13.1579 56.6188 117.4837 26.6634 3.9401 2.4182 15.4761 8.9565 32.5050 2.0993 18.3560 9.2941 2.2720 13.1112 7.5269 50.1760 72.1358 378.8275 9.3481 17.9509 8.1444 3.1165 5.2918 19.2424 52.4422 7.1172 5.3270 20.2949 18.4005 14.0973 12.1000 14.2888 4.8731 10.3717 9.6860 21.6412 18.1132 200.7981 186.5892 43.2548 5.3940 105.9492 30.6422 27.5149 14.7590 28.2915 3.4090 17.3452 18.5993 28.1942 5.0936 48.9435 5.6237 3.6501 5.1684 17.2774 8.0294
temp: 298.150 k
press: 1.00000 atm
elementType: 8 8 8 6 6 6 6 6 6 6 6 6 6 6 6 1 1 1 1 1 1 1 1 1 1 1 1 1 1 1 1
symmnumber: 1
zpe: 659726.9 jmol-1
zpe.correction: 0.251277 hartree
zpe.thermalcorrener: 0.267006 hartree
zpe.thermalcorrenthalpy: 0.267950 hartree
zpe.thermalcorrgfe: 0.207945 hartree
zpe.sumelectzpe: -691.382481 hartree
zpe.sumelectthermal: -691.366752 hartree
zpe.sumelectthermalent: -691.365807 hartree
zpe.sumelectthermalfe: -691.425812 hartree
dipole: -2.2458 2.4547 1.0036
dipole: 3.4751
quadrupole: -96.1987 -88.2883 -91.4270
quadrupole: 6.8726 -7.7546 -2.1385
quadrupole: -4.2274 3.6830 0.5444 6.8726 -7.7546 -2.1385
hfenergy: -691.6337574 hartree
pointgroup: C01 [X(C12H16O3)]
dipole: -0.8535764 -1.0001695 -0.3746101 debye
polarizability: 197.9943504|2.5063633|129.0489098|-9.1011944|2.3739726|101.4359933 unknown
InChI: InChI=1S/C12H16O3/c1-8-6-12(3,4)10(7-13)5-11(8)15-9(2)14/h5-7,11H,1-4H3
charge 0 multiplicity 1
31 atoms
O  -2.046688 -0.146089 -0.472306
O  3.201518 2.273729 -0.143399
O  -3.293769 1.038035 1.108722
C  1.984653 -0.51154 -0.193141
C  1.275951 0.790049 0.175937
C  1.039974 -1.698695 -0.084171
C  -0.948358 -0.355629 0.584448
C  -0.276723 -1.665952 0.255312
C  3.195646 -0.752451 0.767441
C  2.510014 -0.430304 -1.665453
C  -0.04318 0.839874 0.537569
C  -1.144278 -2.904363 0.343659
C  1.992139 2.093397 0.166637
C  -3.174277 0.567748 -0.047409
C  -4.193662 0.683741 -1.160633
H  1.504948 -2.672282 -0.298135
H  -1.49256 -0.388744 1.550906
H  2.862002 -0.811473 1.818919
H  3.690898 -1.707081 0.509705
H  3.932185 0.062222 0.669848
H  1.67884 -0.256177 -2.371405
H  3.24518 0.385675 -1.763696
H  3.002021 -1.381863 -1.939164
H  -0.503427 1.801738 0.805629
H  -1.994952 -2.835901 -0.359617
H  -1.574773 -3.02021 1.358237
H  -0.572308 -3.81779 0.108154
H  1.351494 2.962592 0.466687
H  -5.148817 0.241818 -0.827537
H  -3.849327 0.179834 -2.07485
H  -4.383659 1.750391 -1.371892
