program: Gaussian 09
title: 000184666
version: EM64L-G09RevD.01
frameworkgroup: C1[X(C24H30O4)]
method: RPBEPBE
basis: SDD
operation: Freq
keyword: #pfreq=noraman
keyword: PBEPBE/SDD
title: #p freq=noraman PBEPBE/SDD
converged: NO YES NO NO
title: Mulliken charges:
elementType: O O O O C C C C C C C C C C C C C C C C C C C C C C C C H H H H H H H H H H H H H H H H H H H H H H H H H H H H H H
charge: -0.254581 -0.238241 -0.192431 -0.225333 0.045325 -0.316338 -0.071523 -0.229228 -0.509264 -0.482632 0.257499 -0.520024 0.049193 -0.428421 0.278944 0.367411 -0.590690 -0.239799 0.031691 0.091885 -0.281491 -0.387444 -0.441098 -0.342863 -0.349582 -0.361005 -0.694206 -0.696781 0.257593 0.226416 0.234408 0.252511 0.228726 0.217228 0.239348 0.215576 0.220122 0.281914 0.251431 0.239629 0.240110 0.226947 0.242244 0.199237 0.223389 0.237407 0.232789 0.178968 0.196173 0.206718 0.209874 0.190262 0.212386 0.214188 0.214105 0.207511 0.216056 0.217764
chargesum: 0.00000
title: Mulliken charges with hydrogens summed into heavy atoms:
elementType: O O O O C C C C C C C C C C C C C C C C C C C C C C C C
charge: -0.254581 -0.238241 -0.192431 -0.225333 0.045325 -0.058745 0.154893 0.005180 -0.028027 -0.026055 0.257499 -0.084326 0.049193 -0.146507 0.278944 0.367411 -0.099630 0.000311 0.031691 0.091885 -0.054544 0.054036 0.019698 0.068895 0.053308 0.039131 -0.053528 -0.055450
polarizability: 2.71099316e+02 6.80143511e+00 2.96685642e+02 -2.21831373e+01 -1.62044774e+01 2.15775470e+02
1716.lowfreq: -10.9211 -8.9830 -0.0004 0.0005 0.0006 5.6032 14.0836 15.4575 25.2623
frequency: 12.7954 15.2109 25.2301 39.5070 46.3154 54.8306 59.4586 67.0870 91.3948 103.6478 115.7360 132.9835 144.6018 153.2635 169.1669 183.5575 199.1950 201.5004 209.7559 229.1161 229.7885 232.9449 262.3813 283.7928 294.1600 327.2025 338.6870 353.3307 382.8039 399.6977 412.4990 428.9916 449.7985 476.0490 493.6736 529.6573 552.5595 555.8134 569.7488 597.3671 611.5776 633.8477 649.2197 655.9026 684.1687 693.7592 706.4173 727.1352 732.3300 739.6830 753.0516 782.0513 800.3982 810.7868 821.0924 826.0248 843.9023 855.2526 873.7615 877.6655 881.1935 888.1786 898.6837 901.2618 911.0839 929.3333 940.6406 962.0552 964.8774 979.1246 985.9536 1005.2527 1017.2251 1025.4727 1038.0772 1051.1953 1054.3635 1063.8527 1075.8248 1083.7020 1096.0037 1098.1570 1108.7319 1111.1086 1124.0399 1136.9620 1138.9860 1152.7642 1169.0488 1185.3755 1190.8564 1202.8463 1207.9314 1213.4214 1220.2322 1226.6548 1231.1063 1238.9692 1247.9944 1256.2334 1263.1765 1267.9205 1281.7317 1284.6704 1289.3302 1290.4916 1297.0653 1298.7029 1311.4607 1314.9766 1331.0207 1336.3268 1339.3392 1348.5974 1351.0880 1355.0136 1356.4188 1378.1152 1387.4156 1390.4634 1448.7124 1455.3985 1458.2103 1467.2847 1467.6856 1469.6583 1471.4077 1476.0590 1476.3498 1477.7500 1480.7937 1485.2123 1487.1326 1663.5992 1667.5657 1682.9046 1687.6121 1733.4786 2961.3696 2961.6802 2968.2176 2972.4079 2973.2924 2974.0937 2974.2706 2976.6044 2981.8505 2985.3199 2991.5598 2995.9039 3005.5836 3010.6744 3011.0699 3019.4610 3029.0089 3030.6359 3041.8790 3046.3395 3053.5968 3054.4129 3054.9378 3070.7685 3072.5645 3072.8515 3074.4219 3079.3719 3114.7475 3148.9826
redmass: 4.6973 4.3136 3.2606 1.7571 3.1445 4.1956 3.0040 2.4236 3.7502 4.2261 3.0640 5.5843 3.2396 4.8891 3.5662 3.3644 2.4755 3.7510 3.5118 1.1597 1.2395 2.4540 3.5459 3.5560 3.4745 3.4695 3.7087 2.9511 3.7806 3.5533 3.6361 3.1350 3.8472 4.0531 5.2956 4.8273 5.3416 5.1859 4.4669 7.1727 5.4918 4.7528 4.9962 6.1326 4.0083 4.2202 4.3121 1.6973 1.5332 1.2958 3.7791 1.5831 1.8724 1.4331 2.1992 2.4889 2.7237 2.7137 2.9349 1.4207 2.0555 2.0808 2.1865 2.3930 3.7003 2.3876 1.7227 3.3664 2.3056 3.1223 3.5563 3.7265 2.0088 2.2708 2.7124 3.0315 2.9784 2.2951 2.3054 2.1902 2.2568 2.1635 2.2659 2.3588 2.1835 2.1119 1.5648 2.2266 1.1849 2.5416 1.5753 1.5864 1.4644 1.4732 1.5534 1.3264 1.4525 1.4303 1.4591 1.4060 1.3208 1.3092 1.5443 1.1098 1.0746 1.3105 1.3605 1.1705 1.3339 1.3239 1.6283 1.6571 1.5534 1.5803 1.5655 1.6059 1.7022 2.7306 1.2122 1.2139 1.0805 1.0987 1.0749 1.0677 1.0788 1.0846 1.0656 1.0429 1.0638 1.0444 1.0899 1.0711 1.0822 9.0637 9.2303 11.3648 11.4416 9.8675 1.0648 1.0615 1.0616 1.0478 1.0603 1.0483 1.0386 1.0750 1.0802 1.0659 1.0700 1.0604 1.0834 1.0952 1.0633 1.0981 1.0992 1.0979 1.0908 1.0988 1.1024 1.1025 1.0967 1.1004 1.1001 1.1001 1.0997 1.1036 1.0900 1.0961
irintensity: 0.7810 0.9749 1.1053 0.1494 0.8594 0.7891 3.6861 0.6134 0.1940 1.9894 1.0366 0.5885 0.0705 0.2836 2.0929 0.2472 0.6303 1.0389 2.2049 0.1765 0.5815 0.7647 1.3846 1.0666 2.9889 0.4397 0.8661 1.6753 1.0548 0.7023 0.7577 1.7593 0.8304 1.2436 0.1550 4.7378 1.2326 4.1321 7.3786 2.3961 2.2522 1.2935 7.9920 7.9411 0.3338 11.1397 17.9755 3.5163 6.6295 11.2464 10.1460 4.4120 3.9448 34.0080 9.9037 2.8899 19.6634 2.3986 11.5900 38.5005 6.6131 9.6246 15.9721 32.4556 93.4908 61.6085 24.8438 47.3491 2.6743 42.6977 57.2161 4.7840 6.0786 14.2807 6.8094 0.7392 8.1448 5.0525 0.6256 5.9439 12.8109 9.0290 10.5395 12.9179 3.6761 5.7161 2.4948 60.5323 8.4042 15.9101 0.4428 10.0607 1.3988 3.7255 3.1477 16.2088 4.7424 4.2027 0.6380 21.9427 3.5651 2.3081 4.4924 1.1698 2.0129 2.5030 6.4796 0.9508 1.3417 1.5161 1.2175 2.4784 2.2059 4.5728 2.6853 0.6546 0.1991 8.5699 10.8400 11.1565 2.6879 14.9161 2.7247 0.7315 5.4447 11.6991 3.4410 12.4153 4.0882 11.8593 9.0864 13.8287 16.5655 7.8502 126.1874 99.9912 445.7598 47.3170 5.0795 7.0838 34.2413 59.7096 50.7252 30.8903 24.4333 3.4729 14.1655 23.4886 40.3526 24.7692 30.7505 12.0408 42.3725 10.8041 20.3324 6.5606 50.6964 50.8667 29.9778 2.9032 2.7509 80.3223 61.5957 62.4833 54.4883 33.8900 16.5165 2.5509
temp: 298.150 k
press: 1.00000 atm
elementType: 8 8 8 8 6 6 6 6 6 6 6 6 6 6 6 6 6 6 6 6 6 6 6 6 6 6 6 6 1 1 1 1 1 1 1 1 1 1 1 1 1 1 1 1 1 1 1 1 1 1 1 1 1 1 1 1 1 1
symmnumber: 1
zpe: 1276751.1 jmol-1
zpe.correction: 0.486289 hartree
zpe.thermalcorrener: 0.513256 hartree
zpe.thermalcorrenthalpy: 0.514200 hartree
zpe.thermalcorrgfe: 0.426323 hartree
zpe.sumelectzpe: -1231.339099 hartree
zpe.sumelectthermal: -1231.312132 hartree
zpe.sumelectthermalent: -1231.311188 hartree
zpe.sumelectthermalfe: -1231.399065 hartree
dipole: 1.2084 -6.7903 -1.3992
dipole: 7.0375
quadrupole: -150.4853 -152.6729 -188.3201
quadrupole: 0.6293 -2.1067 4.8735
quadrupole: 13.3408 11.1532 -24.4940 0.6293 -2.1067 4.8735
hfenergy: -1231.825388 hartree
pointgroup: C01 [X(C24H30O4)]
dipole: 0.0523072 -2.7160523 0.5351543 debye
polarizability: 273.4554464|-10.6868769|293.0996274|-26.1598696|12.3377937|217.0053531 unknown
InChI: InChI=1S/C24H30O4/c1-3-5-7-18-16-10-9-15-14-11-12-24(21(15)20(16)23(26)27-18)17(13-14)22(25)28-19(24)8-6-4-2/h8,13-15,18,21H,3-7,9-12H2,1-2H3
charge 0 multiplicity 1
58 atoms
O  -1.178013 0.941485 -1.549917
O  1.979806 0.95003 1.755925
O  -0.054735 -0.101051 -3.323955
O  -0.203616 1.27043 2.533809
C  -1.73679 -0.971468 -0.166041
C  -0.873972 -1.486839 1.076304
C  -0.649256 -3.050515 0.889625
C  -1.331713 -3.533018 -0.449389
C  -3.110186 -1.724092 -0.104218
C  -2.8684 -3.253676 -0.305363
C  -1.02231 -1.382899 -1.432826
C  0.833866 -3.510919 1.00163
C  0.428288 -0.737779 1.208503
C  -0.807192 -2.713516 -1.610131
C  -1.851696 0.538856 -0.331712
C  1.645556 -1.191129 0.79031
C  1.864881 -2.589951 0.287845
C  2.706685 -0.139926 1.031372
C  -0.673089 -0.206846 -2.249243
C  0.603687 0.5754 1.889159
C  -2.457892 1.462101 0.443658
C  3.345221 0.424783 -0.255187
C  -2.485906 2.951646 0.204231
C  4.416124 1.501497 0.022701
C  -3.903456 3.562619 0.36047
C  5.01686 2.078584 -1.278986
C  -3.89878 5.096241 0.186484
C  6.094987 3.151151 -1.013404
H  -1.485137 -1.294191 1.979503
H  -1.201844 -3.560386 1.70348
H  -1.153354 -4.614124 -0.585961
H  -3.771981 -1.318606 -0.888034
H  -3.59226 -1.515801 0.868882
H  -3.252434 -3.831461 0.556222
H  -3.394369 -3.616324 -1.2058
H  0.917893 -4.545126 0.615534
H  1.109674 -3.546269 2.073331
H  -0.314279 -3.142837 -2.488273
H  1.743472 -2.640514 -0.81074
H  2.895565 -2.930728 0.505697
H  3.495761 -0.495871 1.725193
H  -2.924359 1.097502 1.368267
H  2.540862 0.839948 -0.89292
H  3.798649 -0.419226 -0.815336
H  -1.811605 3.432525 0.944816
H  -2.080495 3.183703 -0.797022
H  3.962406 2.315725 0.619448
H  5.228841 1.067605 0.642952
H  -4.304494 3.302268 1.361138
H  -4.583687 3.101659 -0.38266
H  4.202554 2.514119 -1.89224
H  5.452586 1.254821 -1.881437
H  -3.247826 5.577066 0.940915
H  -4.914372 5.51923 0.294995
H  -3.518419 5.379096 -0.813001
H  6.937004 2.733143 -0.429776
H  5.676303 3.998242 -0.438588
H  6.504889 3.55331 -1.957938
