program: Gaussian 09
title: 000184597
version: EM64L-G09RevD.01
frameworkgroup: C1[X(C8H9ClN4O2S)]
method: RPBEPBE
basis: SDD
operation: Freq
keyword: #p
keyword: freq=noraman
keyword: PBEPBE/SDD
title: #p freq=noraman PBEPBE/SDD
converged: YES YES NO NO
title: Mulliken charges:
elementType: Cl S O O N N N N C C C C C C C C H H H H H H H H H
charge: 0.059293 0.345259 -0.325295 -0.254593 -0.175499 -0.437362 0.105553 0.091582 -0.376881 -0.380071 0.505384 -0.536784 -0.024386 -0.303046 -0.301149 -0.380496 0.238711 0.249761 0.242921 0.242164 0.253247 0.254318 0.369334 0.263556 0.274481
chargesum: 0.00000
title: Mulliken charges with hydrogens summed into heavy atoms:
elementType: Cl S O O N N N N C C C C C C C C
charge: 0.059293 0.345259 -0.325295 -0.254593 -0.175499 -0.068028 0.105553 0.091582 0.111591 0.105013 0.505384 -0.029219 -0.024386 -0.039491 -0.026668 -0.380496
polarizability: 1.84508336e+02 -1.60035665e+01 1.73520042e+02 2.24324995e+00 9.29228835e-01 1.06831871e+02
1716.lowfreq: -0.0003 0.0018 0.0022 1.8753 5.5625 10.7764 21.2541 32.1466 38.3330
frequency: 21.2350 32.1281 38.3046 85.1666 109.2252 127.0191 134.4089 148.9961 194.5095 218.7890 267.4832 271.9993 326.7952 349.1099 387.1194 428.6010 446.1001 501.0193 565.3189 582.8696 610.3954 625.7890 645.2392 659.9449 667.9445 708.3236 716.8686 726.5990 741.4901 828.1897 843.6502 881.5612 914.6342 931.2238 931.8142 968.4891 1035.9462 1058.8231 1102.0151 1127.0156 1151.3757 1176.2507 1197.4423 1199.9865 1234.2631 1246.9900 1255.4419 1285.4711 1304.5311 1334.6338 1345.3226 1347.8844 1412.2832 1450.6708 1457.7701 1474.4352 1497.1517 1509.3883 1524.0719 1628.4764 2970.3716 2983.2103 3004.5196 3058.0172 3063.0719 3074.6861 3191.2189 3228.7869 3370.6179
redmass: 11.3131 8.8592 7.3961 8.2217 5.5541 10.1420 2.8893 4.2634 4.4893 5.8886 6.4366 9.3977 7.5472 3.1051 7.3209 6.6672 4.2921 7.1743 7.5907 4.9227 7.4362 1.5589 4.5103 6.8342 7.9674 6.0467 2.3724 3.0454 1.4198 2.4783 1.5224 2.4093 3.1987 3.2890 3.5306 2.7103 2.1304 2.8853 1.6541 3.8629 3.2163 1.3763 1.4724 1.9603 2.4130 1.9907 1.9937 1.8850 1.4633 2.1339 1.2560 1.7222 2.2842 9.9285 1.1049 1.5179 1.0995 2.3115 4.3198 5.7162 1.0670 1.0666 1.0621 1.0964 1.1003 1.1009 1.0958 1.0922 1.0818
irintensity: 3.0355 0.7876 1.7441 0.5460 1.6807 3.0794 1.0099 0.8732 4.8103 4.2196 8.3334 7.4296 1.2330 1.9420 4.8582 6.7522 4.2236 5.6850 7.0575 6.0095 9.3025 47.9973 12.8496 3.1289 24.8631 18.3531 7.8802 18.7930 139.1552 4.0996 14.9172 13.0069 76.2065 91.7600 56.9899 2.5111 1.6531 79.3152 4.0701 3.0592 6.2066 6.6092 13.1849 29.0538 39.1243 215.7685 96.2589 132.9947 61.5827 96.1083 19.3904 14.2846 41.2732 125.8015 25.2428 64.2740 7.4334 137.5935 28.5431 572.3180 45.2276 64.9684 27.9818 28.9732 3.2712 28.0648 4.5187 5.3285 128.7771
temp: 298.150 k
press: 1.00000 atm
elementType: 17 16 8 8 7 7 7 7 6 6 6 6 6 6 6 6 1 1 1 1 1 1 1 1 1
symmnumber: 1
zpe: 460206.4 jmol-1
zpe.correction: 0.175283 hartree
zpe.thermalcorrener: 0.190248 hartree
zpe.thermalcorrenthalpy: 0.191192 hartree
zpe.thermalcorrgfe: 0.130215 hartree
zpe.sumelectzpe: -1536.526425 hartree
zpe.sumelectthermal: -1536.511461 hartree
zpe.sumelectthermalent: -1536.510516 hartree
zpe.sumelectthermalfe: -1536.571494 hartree
dipole: -1.9643 8.2361 0.4295
dipole: 8.4780
quadrupole: -138.5488 -108.0985 -101.7460
quadrupole: 24.5675 -3.3751 0.3673
quadrupole: -22.4177 8.0326 14.3851 24.5675 -3.3751 0.3673
hfenergy: -1536.7017086 hartree
pointgroup: C01 [X(C8H9Cl1N4O2S1)]
dipole: -0.2575406 -3.3097311 0.3238867 debye
dipolederiv: -0.5143546 0.2189843 0.2919825 0.3399427 -0.2345271 -0.2172421 0.3857053 -0.1833151 -0.2053162 -0.2312886 -0.0731783 0.2175403 -0.1467945 -0.200284 -0.0242345 0.2149617 -0.0639179 0.0488107 -0.7934617 -0.2381397 -0.2220736 -0.0814356 -0.4885821 0.079853 -0.4209153 -0.1173189 -0.5602506 -0.3723863 -0.013744 -0.073199 -0.1895335 -1.0360338 0.4084522 0.0037583 0.4293025 -0.5723411 -0.9028548 -0.1845525 0.04322 -0.5906637 -1.0323104 0.0116593 -0.2219071 -0.1004806 -0.435637 -0.6387676 0.146141 -0.1751688 0.0375353 -0.6466194 0.1611812 -0.3370029 0.3736717 -0.8068521 1.0564546 0.7544546 0.1958087 0.6643568 1.7222698 -0.5374328 0.4522784 -0.1373305 0.6848133 -0.483681 -0.0874731 0.1137544 0.0360037 -0.7825588 -0.1983342 0.2325423 -0.1226824 -0.2370006 0.0457989 -0.1590065 -0.1079132 -0.0797149 0.4409018 -0.0796815 -0.1229895 -0.1933551 0.3179141 0.214721 -0.0625189 -0.1074875 -0.260737 0.4887614 -0.1839153 -0.0130679 -0.1173275 0.3412319 0.757389 0.0585138 0.3116742 0.8173576 1.6093206 -0.3433563 0.1874753 -0.6861651 0.7671572 0.9897588 0.0676904 -0.0179284 0.0640626 0.1346507 0.0797612 0.233747 0.2038045 0.3116714 -0.1899952 -0.0278864 -0.0927053 0.0117174 0.2558027 0.1030438 -0.1281781 0.0561924 -0.1954239 -0.5332122 -0.4023849 0.202428 -0.5008376 -1.3511273 0.3091824 0.2175972 0.2517932 -0.3430838 0.0665961 -0.0016183 -0.0902411 -0.0125135 0.1241477 0.0815305 -0.0930295 0.0714472 -0.0296298 1.0237353 -0.0405696 -0.5539869 -0.2152622 0.8467624 0.3350495 -0.6747004 0.2789487 0.3006747 0.0930229 -0.0127543 0.0077598 -0.0037786 -0.1483186 -0.0155015 0.007432 -0.0704951 0.0475706 -0.0391859 -0.0214415 0.1124039 0.0016848 0.0091109 -0.0061611 0.137026 0.1003044 -0.0614656 0.0814553 0.0010168 0.0139736 0.0169061 0.0390292 0.0313452 -0.0437885 0.0701942 -0.1340246 -0.0986537 0.1011021 0.0284296 0.1288371 -0.1138345 0.0579391 0.0788043 -0.0483626 0.0474799 -0.0335122 -0.0263671 -0.0047196 -0.029789 -0.0916706 -0.1163752 0.0051554 -0.0339597 0.0908423 -0.0209929 0.0129489 0.0491659 0.0176286 0.0629061 0.1347255 0.0010869 0.0419984 0.0076728 0.3000083 0.0407253 -0.0791044 -0.0226048 0.3259973 -0.0298595 0.0059546 0.0441208 0.3323328 0.0923588 -0.0577519 -0.101651 -0.0431879 0.0688412 0.0282589 -0.1569848 0.0025142 0.1345715 0.1310475 0.0078096 0.0380379 0.0408204 -0.0026352 -0.0698875 0.0490394 -0.0495818 0.1482821 unknown
polarizability: 176.7040121|14.8632229|177.1063359|-15.2541499|-11.3874433|111.0499019 unknown
InChI: InChI=1S/C8H9ClN4O2S/c9-8-11-3-6(16-8)4-12-2-1-10-7(12)5-13(14)15/h3,5,10H,1-2,4H2
charge 0 multiplicity 1
25 atoms
Cl -4.580697 0.94198 1.664355
S  -1.865662 0.636024 0.153167
O  3.443099 2.141351 0.147256
O  2.344125 3.242727 -1.542573
N  1.010284 -1.243066 -0.407298
N  2.632777 -0.275716 0.812056
N  2.501588 2.194369 -0.790117
N  -3.61297 -1.35913 0.527796
C  1.24507 -2.176966 0.728587
C  2.59243 -1.661686 1.314546
C  1.758146 -0.079669 -0.22343
C  -0.20473 -1.335646 -1.225749
C  -1.488457 -1.023851 -0.487042
C  1.642064 1.093454 -0.985046
C  -2.525858 -1.891683 -0.180441
C  -3.430303 -0.085362 0.774885
H  1.311941 -3.218729 0.371225
H  0.42267 -2.105418 1.468976
H  2.606802 -1.692506 2.416459
H  3.450468 -2.248587 0.932061
H  -0.28579 -2.369979 -1.610526
H  -0.081106 -0.685225 -2.109429
H  3.318859 0.47478 0.992661
H  0.905939 1.230864 -1.772625
H  -2.552588 -2.94723 -0.457055
