program: Gaussian 09
title: 000184586
version: EM64L-G09RevD.01
frameworkgroup: C1[X(C7H6N2O6)]
method: RPBEPBE
basis: SDD
operation: Freq
keyword: #pfreq=noraman
keyword: PBEPBE/SDD
title: #p freq=noraman PBEPBE/SDD
converged: YES YES NO NO
title: Mulliken charges:
elementType: O O O O O O N N C C C C C C C H H H H H H
charge: -0.211811 -0.376840 -0.168798 -0.192365 -0.171095 -0.194614 0.020238 0.020241 0.305047 0.339724 0.220804 -0.449653 0.181060 -0.477002 -0.536169 0.301242 0.283309 0.260931 0.237487 0.233608 0.374654
chargesum: 0.00000
title: Mulliken charges with hydrogens summed into heavy atoms:
elementType: O O O O O O N N C C C C C C C
charge: -0.211811 -0.002186 -0.168798 -0.192365 -0.171095 -0.194614 0.020238 0.020241 0.305047 0.339724 0.220804 -0.148411 0.181060 -0.193692 0.195858
polarizability: 1.77208457e+02 2.73145427e+00 1.47516561e+02 2.44259730e+00 8.69055586e+00 5.99341946e+01
1716.lowfreq: -4.9913 -0.0002 0.0006 0.0009 3.4184 4.9395 32.2103 55.6378 89.1060
frequency: 32.1706 55.6351 89.1047 112.6188 139.0089 157.5537 186.2137 198.5202 236.7957 247.0463 291.2937 315.6483 350.8370 369.5742 401.3322 408.8463 451.3200 477.6527 565.4274 581.7399 621.7155 637.4544 696.7687 723.9247 736.3434 738.0200 749.0693 817.3849 869.5528 882.7962 948.2171 1005.8005 1104.4508 1111.7509 1128.1005 1158.7703 1196.8085 1218.9746 1226.2729 1273.2652 1289.3930 1357.2740 1391.3655 1400.0355 1437.4219 1439.9575 1468.5295 1471.7757 1512.6975 1595.8772 1600.9350 2977.6053 3074.1278 3146.6424 3153.4955 3186.7837 3573.9469
redmass: 15.4144 5.0801 15.6200 5.5513 5.1746 4.7364 14.3298 2.2163 4.7654 1.7850 8.0267 5.2833 8.9421 6.6792 1.5765 2.9924 3.7752 5.2940 8.5134 10.7117 5.7771 9.3053 8.1215 6.7587 4.6557 6.6485 6.5295 5.7561 1.7101 1.4931 8.4129 9.0126 1.9121 1.2586 2.0148 1.3491 7.3885 5.5946 2.8667 1.8070 2.6388 10.3979 13.4400 8.1175 2.3321 1.9362 1.0657 1.0488 3.6581 7.6002 7.4446 1.0324 1.1050 1.1007 1.0920 1.0910 1.0664
irintensity: 0.9687 0.2521 0.1418 0.5027 13.0901 5.3392 0.8731 0.4437 6.7689 2.3236 1.8494 1.5006 1.7826 3.0462 106.5819 41.7111 0.8134 7.6701 5.7146 4.8240 10.0512 14.0899 6.5529 19.1969 20.9097 10.4232 25.1212 0.5626 12.9788 43.0334 8.7549 87.7526 235.7590 0.1923 10.1196 7.5652 339.1016 350.5708 1.7249 184.0351 93.6278 85.7861 60.4089 157.6206 0.5925 26.6826 50.1363 17.7701 112.9071 90.3714 124.3919 44.2709 31.8317 12.9534 4.2134 3.4275 85.9931
temp: 298.150 k
press: 1.00000 atm
elementType: 8 8 8 8 8 8 7 7 6 6 6 6 6 6 6 1 1 1 1 1 1
symmnumber: 1
zpe: 356437.2 jmol-1
zpe.correction: 0.135760 hartree
zpe.thermalcorrener: 0.149477 hartree
zpe.thermalcorrenthalpy: 0.150421 hartree
zpe.thermalcorrgfe: 0.094521 hartree
zpe.sumelectzpe: -829.880463 hartree
zpe.sumelectthermal: -829.866747 hartree
zpe.sumelectthermalent: -829.865802 hartree
zpe.sumelectthermalfe: -829.921702 hartree
dipole: 7.4865 -1.6576 -0.0093
dipole: 7.6679
quadrupole: -97.8454 -79.2671 -87.0875
quadrupole: 8.3810 -0.4215 -1.7200
quadrupole: -9.7788 8.7996 0.9792 8.3810 -0.4215 -1.7200
hfenergy: -830.0162231 hartree
pointgroup: C01 [X(C7H6N2O6)]
dipole: 2.9829396 -0.4479547 -0.0477842 debye
dipolederiv: -1.5814891 -0.6873374 -0.0521836 -0.5912551 -0.5587801 -0.0201226 -0.0613703 -0.0234656 -0.2707546 -0.7635838 0.7817395 0.0762464 0.8013264 -0.836363 -0.0336046 0.0854678 -0.0258405 -0.385588 -0.6184689 0.1550223 -0.2731328 0.1391107 -0.391243 -0.0645047 -0.249457 -0.0597458 -0.3987937 -0.3699983 0.0447955 -0.1198047 0.0994846 -0.8023831 -0.2509352 -0.0968665 -0.1618806 -0.3912512 -0.7057607 -0.0368941 0.2203945 0.0334038 -0.3226823 -0.1846376 0.2201044 -0.1539226 -0.404977 -0.5296743 -0.2203214 -0.0021086 -0.2889224 -0.6982474 -0.2622784 0.0049235 -0.1859743 -0.3847863 1.0069538 -0.5560928 0.4495983 -0.4975746 1.3389423 0.3452394 0.319023 0.2373228 0.624216 1.5813225 0.5716718 -0.2730745 0.4553727 0.8987747 0.4920667 -0.2172643 0.3306308 0.6187326 -0.0456126 0.5325332 -0.0377738 0.4842499 -0.2200071 -0.0685776 0.1228688 0.0264655 0.0044759 -0.6276184 -0.447488 0.023292 -0.3486328 0.1713189 -0.0579361 -0.0655639 0.0898322 0.0157131 1.5932193 0.6395721 0.0524267 0.5061226 -0.1543358 -0.0176296 0.072074 -0.0344197 0.1064816 -0.3725789 -0.4211457 -0.0183629 0.2032276 0.0343672 0.0287301 0.0828979 -0.0493456 -0.1356835 0.5842911 -0.949786 -0.0845703 -1.0496318 0.655949 0.0668387 -0.1344181 0.0493937 0.0837313 -0.1050337 0.5346087 0.0345516 -0.0958102 -0.1352212 0.0191102 -0.098133 -0.0350447 -0.126886 0.4513232 0.1873846 0.0159216 0.5675665 0.6374406 0.0217803 0.0702208 0.0387243 0.3079684 0.116364 -0.0150363 0.0085361 -0.0457116 0.0530874 -0.0037751 -0.0448343 -0.0078078 0.1652813 0.1034471 -0.0016614 -0.0038935 0.025983 0.0205546 -0.0050297 0.0366463 -0.0264724 0.1743704 -0.1126945 -0.0451274 -0.0084151 0.0002483 0.0871396 -0.0030675 -0.0052109 -0.0044895 0.1319281 0.0739902 0.0604875 0.1066417 -0.1067419 -0.026179 -0.0490889 0.0312221 -0.0786004 -0.0697793 0.0740912 0.0725968 -0.0897238 -0.1042444 -0.060632 0.0586637 -0.0511445 0.0855092 -0.0553654 0.2475108 -0.1995216 -0.0245652 -0.1875711 0.3084996 -0.0112415 -0.0211858 -0.010869 0.3909662 unknown
polarizability: 176.7123182|4.6382896|146.2600921|1.7553739|15.1703107|61.6868017 unknown
InChI: InChI=1S/C7H6N2O6/c1-15-7-3-5(9(13)14)4(8(11)12)2-6(7)10/h2-3,10H,1H3
charge 0 multiplicity 1
21 atoms
O  3.233473 0.367664 0.012199
O  2.586028 -2.202044 -0.233426
O  -2.524949 1.579014 -0.80692
O  -1.231908 2.832639 0.600609
O  -3.03127 -0.587995 0.854936
O  -2.508288 -2.324692 -0.537424
N  -1.50022 1.749669 -0.050267
N  -2.225383 -1.226383 0.082649
C  -0.502412 0.653604 0.025802
C  -0.84215 -0.71471 -0.054279
C  1.882214 0.08476 -0.01506
C  0.85115 1.045518 0.058336
C  1.533383 -1.302195 -0.142264
C  0.17929 -1.682357 -0.149945
C  3.637306 1.77604 0.166681
H  1.068446 2.113902 0.126953
H  -0.114652 -2.735688 -0.216033
H  4.73517 1.750116 0.185314
H  3.251467 2.194981 1.114557
H  3.288378 2.382585 -0.689757
H  2.261625 -3.13193 -0.337261
