program: Gaussian 09
title: 000184585
version: EM64L-G09RevD.01
frameworkgroup: C1[X(C14H9Cl2N3OS)]
method: RPBEPBE
basis: SDD
operation: Freq
keyword: #p
keyword: freq=noraman
keyword: PBEPBE/SDD
title: #p freq=noraman PBEPBE/SDD
converged: NO YES NO NO
title: Mulliken charges:
elementType: Cl Cl S O N N N C C C C C C C C C C C C C C H H H H H H H H H
charge: -0.048437 -0.060869 0.389356 -0.208376 -0.487494 -0.330878 -0.509531 0.393265 -0.406584 0.231223 -0.283770 -0.237582 -0.127837 0.506630 -0.220435 0.279063 -0.441783 -0.316748 -0.184911 -0.200217 -0.120335 0.228788 0.255681 0.300598 0.264748 0.290962 0.221197 0.312394 0.255491 0.256393
chargesum: 0.00000
title: Mulliken charges with hydrogens summed into heavy atoms:
elementType: Cl Cl S O N N N C C C C C C C C C C C C C C
charge: -0.048437 -0.060869 0.389356 -0.208376 -0.186896 -0.330878 -0.218569 0.393265 -0.406584 0.231223 -0.054983 0.018099 -0.127837 0.506630 0.044313 0.279063 -0.220586 -0.004354 0.070579 0.056176 -0.120335
polarizability: 3.75646160e+02 -8.65843776e-01 2.41319414e+02 1.55422531e-02 6.07285838e-02 7.69570548e+01
1716.lowfreq: -20.7642 -1.8046 -0.0022 -0.0020 0.0016 3.2072 5.9438 23.3618 38.2909
frequency: -20.6078 23.3549 38.2879 54.6605 59.9553 91.7928 102.3463 133.0438 160.4158 174.6521 201.2867 242.2999 262.8296 294.1105 299.6962 311.4584 311.7043 359.9177 398.3954 409.6230 412.5381 420.4376 429.5564 502.5754 515.6385 521.8179 540.3769 562.8160 590.2759 618.9562 635.5568 643.0184 694.6951 698.7664 703.5665 711.0319 735.1061 776.3748 808.3811 812.0775 819.1321 844.1836 848.6728 906.6033 932.0357 955.4930 972.1979 978.7475 992.5058 1033.1264 1073.0975 1075.0530 1114.2182 1120.6882 1147.9004 1168.4005 1186.9030 1253.0655 1262.4039 1287.5496 1298.3869 1363.8181 1389.3682 1401.1909 1404.3286 1420.3287 1475.2644 1488.2410 1502.4719 1517.2090 1568.7301 1590.4507 1597.8704 1607.8591 1670.3982 3117.1152 3140.3444 3157.9329 3168.4952 3174.8794 3180.6408 3197.8734 3524.2797 3547.5391
redmass: 4.8254 9.6510 13.0932 5.9354 5.8713 8.8660 11.7434 5.0369 3.9002 12.3961 11.4484 5.3203 8.5945 10.4329 5.5289 4.5234 22.1715 5.4508 11.6816 2.9254 2.0780 2.6675 6.6087 3.3576 3.3196 11.2998 10.0613 8.2587 1.2243 7.5840 8.8968 5.2805 7.1664 5.3923 5.2997 8.0235 4.8434 8.2951 1.4078 1.3417 6.4904 1.4110 1.6033 6.9639 1.3606 1.3397 8.4342 1.3181 4.2628 6.9988 1.9946 2.6507 2.2135 2.0335 1.3610 2.3278 1.1143 1.5815 2.2646 2.0006 1.5956 4.9108 7.0476 4.3246 3.6037 3.1240 3.1850 3.5622 2.1059 2.1453 6.1237 7.1841 5.2714 6.2489 4.6061 1.0902 1.0920 1.0893 1.0911 1.0949 1.0971 1.0954 1.0765 1.0759
irintensity: 3.1615 0.0868 0.0274 4.0952 3.2903 2.0514 1.5428 0.5169 0.4241 1.4645 0.6305 3.5661 1.1228 5.4001 0.8631 0.6767 1.4553 3.3712 48.2844 0.0237 3.2047 2.2311 1.9280 7.1172 55.0513 6.6536 12.0502 13.1990 144.6781 11.6051 18.4249 0.0136 2.2983 14.5268 4.9648 21.9319 9.3114 21.8756 40.4649 37.3252 9.2870 61.0072 27.6521 11.1875 1.0414 0.0138 16.9207 3.1130 32.8593 29.0124 24.2247 64.9069 34.5444 10.4568 50.5931 419.1979 0.3143 4.0741 114.5082 11.1191 18.0995 194.5122 50.2031 6.0225 22.7804 197.9726 772.5146 185.8968 702.5352 26.3264 17.7393 12.3727 26.9471 19.6890 124.8726 17.9025 6.7770 1.3351 2.3028 2.4945 2.8583 9.8438 5.1772 13.9615
temp: 298.150 k
press: 1.00000 atm
elementType: 17 17 16 8 7 7 7 6 6 6 6 6 6 6 6 6 6 6 6 6 6 1 1 1 1 1 1 1 1 1
symmnumber: 1
zpe: 530785.4 jmol-1
zpe.correction: 0.202165 hartree
zpe.thermalcorrener: 0.219967 hartree
zpe.thermalcorrenthalpy: 0.220911 hartree
zpe.thermalcorrgfe: 0.154112 hartree
zpe.sumelectzpe: -2095.098218 hartree
zpe.sumelectthermal: -2095.080417 hartree
zpe.sumelectthermalent: -2095.079473 hartree
zpe.sumelectthermalfe: -2095.146272 hartree
dipole: 4.2052 4.4545 0.0062
dipole: 6.1259
quadrupole: -143.9954 -144.1045 -147.8082
quadrupole: -9.7139 -0.0090 0.0245
quadrupole: 1.3073 1.1982 -2.5055 -9.7139 -0.0090 0.0245
hfenergy: -2095.3003838 hartree
pointgroup: C01 [X(C14H9Cl2N3O1S1)]
dipole: 1.6280286 1.7771284 0.0013849 debye
polarizability: 375.6419478|1.1469052|241.3236391|0.0176386|-0.0380637|76.9570414 unknown
InChI: InChI=1S/C14H9Cl2N3OS/c15-8-1-4-10(5-2-8)17-14(20)18-13-11-7-9(16)3-6-12(11)21-19-13/h1-7,17-18H
charge 0 multiplicity 1
30 atoms
Cl 5.048158 3.398232 -0.00338
Cl -7.779384 0.339645 -0.001588
S  3.430349 -2.788962 0.002342
O  -1.097465 -1.782882 -0.000847
N  0.54274 -0.080499 0.0008
N  1.703412 -2.193097 0.002233
N  -1.718821 0.494489 0.001375
C  3.024115 -0.167336 0.000183
C  4.094768 -1.109147 0.000804
C  1.719866 -0.849004 0.001053
C  3.312235 1.222496 -0.001118
C  5.443085 -0.691326 0.000177
C  4.656184 1.618566 -0.001702
C  -3.139013 0.393457 0.0006
C  5.726111 0.689168 -0.001073
C  -0.793347 -0.566043 0.000445
C  -3.875263 1.60951 0.001806
C  -3.835463 -0.845263 -0.001284
C  -5.284282 1.60012 0.001155
C  -5.246725 -0.853835 -0.001953
C  -5.954313 0.362002 -0.000732
H  2.526786 1.985916 -0.00173
H  6.262393 -1.416033 0.000645
H  0.690236 0.929796 0.000547
H  6.75973 1.045594 -0.001576
H  -1.362319 1.452462 0.003021
H  -3.350067 2.573312 0.003268
H  -3.27466 -1.781011 -0.00217
H  -5.846133 2.538053 0.002102
H  -5.784616 -1.80608 -0.003405
