program: Gaussian 09
title: 000184584
version: EM64L-G09RevD.01
frameworkgroup: C1[X(C14H9Cl2N3OS)]
method: RPBEPBE
basis: SDD
operation: Freq
keyword: #p
keyword: freq=noraman
keyword: PBEPBE/SDD
title: #p freq=noraman PBEPBE/SDD
converged: NO YES NO NO
title: Mulliken charges:
elementType: Cl Cl S O N N N C C C C C C C C C C C C C C H H H H H H H H H
charge: -0.047397 -0.067006 0.388848 -0.205882 -0.487597 -0.330941 -0.513674 0.393265 -0.405935 0.231685 -0.282439 -0.237743 -0.129077 0.521944 -0.220140 0.280580 -0.443272 -0.346606 -0.042597 -0.191937 -0.258912 0.228962 0.255617 0.301231 0.264755 0.294274 0.244836 0.311653 0.234696 0.258809
chargesum: 0.00000
title: Mulliken charges with hydrogens summed into heavy atoms:
elementType: Cl Cl S O N N N C C C C C C C C C C C C C C
charge: -0.047397 -0.067006 0.388848 -0.205882 -0.186366 -0.330941 -0.219401 0.393265 -0.405935 0.231685 -0.053478 0.017874 -0.129077 0.521944 0.044615 0.280580 -0.198437 -0.034953 -0.042597 0.042758 -0.000103
polarizability: 3.50685556e+02 4.38757997e+00 2.58965853e+02 8.59327745e-03 3.69481608e-03 7.71104949e+01
1716.lowfreq: -19.9226 -7.0683 -3.2624 -1.5768 -0.0019 -0.0014 0.0006 24.0869 36.9560
frequency: -19.7909 24.0371 36.9553 47.4965 62.0556 91.1147 109.2780 153.5925 157.7718 180.9381 218.2876 222.8711 243.1694 253.2594 297.1455 299.4940 313.0892 362.1008 407.8249 408.7192 418.8290 425.9777 438.8641 507.9151 508.1434 522.1574 558.2714 560.3338 600.8371 601.5210 642.7653 657.1534 682.7104 694.3855 701.7140 727.1252 734.6040 779.4942 788.8069 811.4716 834.9489 847.5900 854.7364 911.2732 915.9920 954.7899 976.9547 978.9489 990.8919 1033.5757 1072.1309 1072.6793 1097.4547 1117.5271 1147.2851 1166.5122 1179.7461 1251.1358 1253.9185 1285.0955 1306.7928 1367.1799 1388.9098 1403.9946 1412.3147 1419.9430 1469.9747 1487.4544 1505.1272 1516.7439 1568.3857 1587.9629 1589.5932 1614.5081 1672.9697 3138.5117 3139.3869 3148.3853 3157.6652 3179.6996 3182.8199 3203.6802 3521.5244 3547.0287
redmass: 6.3687 6.8737 13.5681 8.7798 4.6953 8.8667 10.3404 14.5858 4.0214 5.3499 9.0087 2.8725 6.5657 10.6189 10.2017 7.1734 19.8488 6.2971 8.9342 1.8665 2.6873 6.9763 2.9671 4.4422 8.6182 11.2091 8.5706 2.8537 1.4816 9.8681 5.2410 7.5225 2.3025 7.1325 10.9379 9.0786 4.8050 7.8850 1.3070 1.3426 7.1417 1.6183 1.6193 1.3678 6.7801 1.3411 6.4170 7.5261 1.3142 7.0384 1.9688 2.0778 1.5468 4.9208 1.3661 2.2753 1.1007 1.9085 1.4640 2.3285 1.7548 4.4403 7.1272 3.6800 3.4595 3.1018 3.0165 4.8545 2.0379 2.1471 6.2573 4.8787 6.8915 6.5423 4.7737 1.0925 1.0922 1.0891 1.0892 1.0973 1.0954 1.0952 1.0767 1.0759
irintensity: 0.4791 0.0134 0.0401 10.3490 0.2097 2.0212 2.8021 0.4413 0.5371 0.7429 2.0086 0.7299 5.1377 1.4770 8.6580 1.6267 1.1903 6.6782 7.7876 1.5006 3.1156 8.1099 6.6992 9.3481 41.5309 7.6161 14.1244 42.7896 123.3769 5.9487 0.0219 3.4322 29.8149 2.2258 15.1360 50.8665 10.2077 8.4383 54.9503 37.4382 16.4596 17.8510 56.5371 4.4138 29.7373 0.0078 10.8404 21.0630 4.1859 20.3900 31.3371 18.4756 27.1746 56.6145 70.0331 441.4882 7.8885 13.3566 44.1146 32.5745 55.4398 167.6829 49.7799 13.9177 25.6190 207.5379 656.6553 217.9927 630.5522 12.4005 26.6957 166.1655 0.2134 117.1151 120.5857 7.4121 6.5030 9.2728 1.2754 2.9251 2.2914 9.2293 5.0394 14.0012
temp: 298.150 k
press: 1.00000 atm
elementType: 17 17 16 8 7 7 7 6 6 6 6 6 6 6 6 6 6 6 6 6 6 1 1 1 1 1 1 1 1 1
symmnumber: 1
zpe: 530699.5 jmol-1
zpe.correction: 0.202133 hartree
zpe.thermalcorrener: 0.219952 hartree
zpe.thermalcorrenthalpy: 0.220896 hartree
zpe.thermalcorrgfe: 0.154015 hartree
zpe.sumelectzpe: -2095.098497 hartree
zpe.sumelectthermal: -2095.080678 hartree
zpe.sumelectthermalent: -2095.079734 hartree
zpe.sumelectthermalfe: -2095.146615 hartree
dipole: -2.9112 2.9346 0.0006
dipole: 4.1336
quadrupole: -129.0364 -153.0467 -147.8261
quadrupole: -3.7873 0.0090 0.0018
quadrupole: 14.2667 -9.7437 -4.5230 -3.7873 0.0090 0.0018
hfenergy: -2095.3006301 hartree
pointgroup: C01 [X(C14H9Cl2N3O1S1)]
dipole: 1.1886454 1.1099203 -0.000588 debye
polarizability: 350.2162804|-7.8786085|259.4351154|-0.0054571|-0.04868|77.1105078 unknown
InChI: InChI=1S/C14H9Cl2N3OS/c15-8-2-1-3-10(6-8)17-14(20)18-13-11-7-9(16)4-5-12(11)21-19-13/h1-7,17-18H
charge 0 multiplicity 1
30 atoms
Cl 4.757007 3.560566 -0.001551
Cl -6.412175 2.645883 0.000776
S  3.537772 -2.71741 0.001356
O  -1.048528 -1.994376 -0.00001
N  0.485193 -0.196054 -0.000621
N  1.776204 -2.232523 0.000704
N  -1.805527 0.243252 -0.000519
C  2.966195 -0.127266 -0.000085
C  4.094678 -0.998712 0.0006
C  1.70784 -0.890163 0.000012
C  3.164618 1.278011 -0.000749
C  5.413564 -0.495165 0.000631
C  4.480337 1.759704 -0.000708
C  -3.216482 0.060476 -0.000163
C  5.607571 0.900597 -0.000033
C  -0.818395 -0.762108 -0.000687
C  -4.012659 1.239623 0.000115
C  -3.843269 -1.214988 -0.000108
C  -5.410649 1.11788 0.000428
C  -5.25184 -1.288228 0.000215
C  -6.06196 -0.129122 0.000488
H  2.331956 1.989679 -0.001288
H  6.277643 -1.165936 0.001158
H  0.570926 0.821383 -0.001103
H  6.6165 1.32203 -0.000027
H  -1.503453 1.21983 -0.000504
H  -3.550221 2.233083 0.000084
H  -3.230555 -2.11718 -0.000302
H  -5.731918 -2.272488 0.000256
H  -7.152772 -0.193479 0.000737
