program: Gaussian 09
title: 000184563
version: EM64L-G09RevD.01
frameworkgroup: C1[X(C10H9N3O4S)]
method: RPBEPBE
basis: SDD
operation: Freq
keyword: #p
keyword: freq=noraman
keyword: PBEPBE/SDD
title: #p freq=noraman PBEPBE/SDD
converged: YES YES YES YES
title: Mulliken charges:
elementType: S O O O O N N N C C C C C C C C C C H H H H H H H H H
charge: 0.486453 -0.318706 -0.198665 -0.198715 -0.197551 -0.445522 -0.340777 0.013137 0.373412 -0.590222 0.211555 0.503916 -0.363968 -0.364564 -0.209458 0.277607 -0.214599 -0.672457 0.225585 0.292058 0.245345 0.343473 0.233440 0.233427 0.217337 0.229229 0.229230
chargesum: 0.00000
title: Mulliken charges with hydrogens summed into heavy atoms:
elementType: S O O O O N N N C C C C C C C C C C
charge: 0.486453 -0.318706 -0.198665 -0.198715 -0.197551 -0.102049 -0.340777 0.013137 0.373412 -0.590222 0.211555 0.503916 -0.138383 -0.072506 0.035887 0.277607 0.252269 0.003339
polarizability: 2.75551425e+02 -5.17049304e+00 1.81634488e+02 -1.10366465e-03 -1.97096647e-02 7.08669088e+01
1716.lowfreq: -27.5676 -7.9733 -2.3606 -1.0381 0.0014 0.0022 0.0022 28.6618 45.4478
frequency: -25.4186 28.6194 45.2362 59.0001 78.6870 104.0826 143.7909 147.0062 195.2745 197.1199 206.5602 207.1830 247.9204 297.4350 305.2650 347.9075 369.1511 378.4003 465.1883 489.5738 492.4164 535.5763 542.6173 581.2297 596.6782 624.2993 661.3386 699.3118 701.2711 702.8175 721.4000 725.1646 780.3108 799.1334 811.3124 851.0873 924.9551 929.5691 965.3175 991.4800 1036.1703 1041.4614 1088.9681 1108.6313 1124.4536 1139.5598 1155.0537 1166.6624 1200.7016 1214.7923 1251.3821 1309.2106 1356.7771 1359.5463 1388.6027 1399.0012 1423.6484 1443.0929 1463.5059 1475.5997 1488.1395 1494.7591 1514.5741 1574.8236 1601.3936 1693.4068 2996.5180 3010.5015 3069.4706 3094.2567 3107.6419 3130.3215 3165.5217 3184.8559 3560.0088
redmass: 2.4983 6.7453 5.3629 5.1807 6.7169 6.0629 4.3581 6.9955 7.7745 4.2365 6.4768 8.0107 1.2182 9.4328 7.0822 8.8988 5.5374 6.4619 5.6714 11.7689 4.1845 9.5881 8.4343 7.0520 1.2423 5.8964 9.1466 10.3958 8.4651 4.7546 7.4499 3.8754 5.5886 1.0960 1.6955 5.4937 6.3750 1.4129 5.3092 1.3568 3.4473 4.6005 2.5818 2.4468 3.3853 1.4673 2.4323 1.8725 1.6867 4.3198 1.1286 3.0696 4.5383 1.5592 4.2439 1.2659 4.4164 3.0334 1.0405 1.0607 1.1020 3.6901 2.8227 6.4307 7.2575 8.7002 1.0356 1.0580 1.1069 1.0986 1.1029 1.0898 1.0911 1.0973 1.0760
irintensity: 0.0515 0.9993 1.0005 0.1751 2.9913 1.7635 1.4328 2.8194 8.7996 0.9749 0.4759 0.0684 0.6292 9.2093 14.0025 0.8328 2.1008 2.1151 0.5864 10.8879 3.3119 1.7713 1.9040 19.4147 59.0739 7.4892 9.0997 14.9356 30.6378 6.4734 4.1468 45.0452 0.5811 3.1341 54.8158 5.3934 2.6789 0.4182 122.7199 1.4905 117.7355 126.5594 150.1827 80.7565 223.1052 5.1667 109.6053 139.4056 12.3619 267.6808 0.0001 28.3897 65.6670 35.2986 186.1074 27.5196 2.8462 27.5680 12.6805 24.4173 20.1591 30.0827 857.5960 14.9263 34.2611 225.8856 20.9361 22.3131 6.7067 30.0195 45.3869 8.4286 7.2740 4.4512 27.9244
temp: 298.150 k
press: 1.00000 atm
elementType: 16 8 8 8 8 7 7 7 6 6 6 6 6 6 6 6 6 6 1 1 1 1 1 1 1 1 1
symmnumber: 1
zpe: 489175.2 jmol-1
zpe.correction: 0.186317 hartree
zpe.thermalcorrener: 0.202166 hartree
zpe.thermalcorrenthalpy: 0.203110 hartree
zpe.thermalcorrgfe: 0.141551 hartree
zpe.sumelectzpe: -1248.293245 hartree
zpe.sumelectthermal: -1248.277396 hartree
zpe.sumelectthermalent: -1248.276452 hartree
zpe.sumelectthermalfe: -1248.338011 hartree
dipole: 4.5405 7.2714 -0.0014
dipole: 8.5727
quadrupole: -114.2381 -110.3979 -110.6672
quadrupole: -0.4430 0.0043 0.0007
quadrupole: -2.4704 1.3699 1.1005 -0.4430 0.0043 0.0007
hfenergy: -1248.4795625 hartree
pointgroup: C01 [X(C10H9N3O4S1)]
dipole: -1.6957897 2.9154212 0.0005374 debye
polarizability: 275.7832064|2.2163152|181.4027065|-0.000485|0.0197346|70.8669088 unknown
InChI: InChI=1S/C10H9N3O4S/c1-2-17-10(14)11-9-6-4-3-5-7(13(15)16)8(6)18-12-9/h3-5,11H,2H2,1H3
charge 0 multiplicity 1
27 atoms
S  1.382409 -2.081614 -0.000047
O  -4.138292 0.453034 -0.000108
O  5.370363 0.158507 -0.000048
O  4.105038 -1.748384 -0.00095
O  -3.358579 -1.774559 -0.000171
N  -1.915253 0.124523 0.000312
N  -0.42702 -1.762247 -0.000308
N  4.235958 -0.455041 -0.000631
C  0.548787 0.444354 0.000269
C  1.750616 -0.326583 -0.000052
C  -0.63219 -0.438892 0.000131
C  2.998326 0.335591 -0.000168
C  0.619159 1.857397 0.000565
C  3.070233 1.744059 0.000157
C  1.876457 2.500195 0.000528
C  -3.146083 -0.548835 0.000283
C  -5.543674 -0.050745 -0.000718
C  -6.44967 1.175824 -0.001146
H  -0.290708 2.469445 0.000807
H  4.054946 2.219476 0.000085
H  1.92897 3.592751 0.000748
H  -1.992395 1.142828 0.000461
H  -5.685803 -0.682305 -0.89615
H  -5.686584 -0.682258 0.894623
H  -7.50741 0.855902 -0.001596
H  -6.275889 1.795915 0.894835
H  -6.27511 1.795864 -0.89701
