program: Gaussian 09
title: 000015700
version: EM64L-G09RevD.01
frameworkgroup: C1[X(C15H13NO)]
method: RPBEPBE
basis: SDD
operation: Freq
keyword: #p
keyword: freq=noraman
keyword: PBEPBE/SDD
title: #p freq=noraman PBEPBE/SDD
converged: NO YES NO NO
title: Mulliken charges:
elementType: O N C C C C C C C C C C C C C C C H H H H H H H H H H H H H
charge: -0.414320 -0.083649 -0.546344 -0.618518 0.319405 0.360165 0.184364 0.243714 -0.114885 -0.373874 -0.434423 -0.356179 -0.343624 -0.247266 -0.230181 -0.251057 -0.255239 0.239166 0.221898 0.230648 0.214175 0.232790 0.236304 0.257534 0.248791 0.228430 0.226085 0.230093 0.228736 0.367262
chargesum: 0.00000
title: Mulliken charges with hydrogens summed into heavy atoms:
elementType: O N C C C C C C C C C C C C C C C
charge: -0.047058 -0.083649 -0.085280 -0.173695 0.319405 0.360165 0.184364 0.243714 -0.114885 -0.141083 -0.198119 -0.098645 -0.094833 -0.018836 -0.004096 -0.020964 -0.026504
polarizability: 2.21131533e+02 -9.12379332e-01 1.83572080e+02 3.55330003e-01 -5.40490725e+00 1.06083727e+02
1716.lowfreq: -15.6189 -11.0007 -8.2773 -0.0004 -0.0003 0.0005 41.2109 85.2414 93.8722
frequency: 41.1308 85.2334 93.8565 134.4709 160.0287 194.4561 232.5544 254.5802 297.9313 313.8645 335.3253 372.4325 418.7331 442.0820 453.4025 466.0504 484.3190 526.0524 533.0260 577.1913 590.3521 638.8933 671.5501 685.2885 718.5025 748.4655 761.5536 768.4214 779.7656 792.3612 868.7661 871.9417 882.2227 917.6365 939.9503 956.1367 964.6183 970.1423 988.1654 988.5656 1033.2569 1041.5975 1054.7676 1088.4900 1109.5610 1156.7993 1163.6446 1175.1931 1175.2864 1195.4806 1215.7419 1226.3667 1259.6575 1275.7526 1289.1171 1318.5956 1326.1046 1354.4715 1376.1986 1381.4130 1425.7894 1437.7992 1445.6686 1469.8836 1479.1070 1483.6886 1545.2464 1578.2782 1589.7475 1608.5245 1610.7948 2960.4018 2985.9594 3016.5276 3049.3424 3112.1808 3118.5802 3133.6271 3134.0938 3151.7232 3152.4853 3168.3323 3169.4052 3552.8663
redmass: 4.4773 4.1342 4.7129 4.0022 3.3570 4.9942 3.9948 4.3295 4.8497 4.3888 4.1288 3.4816 2.2393 2.4327 2.9198 2.0058 4.2980 3.6364 4.2223 3.3840 3.9905 5.6897 5.6595 4.9398 2.9307 2.3826 1.4976 2.5831 2.1316 3.5889 1.3696 4.2360 1.5613 2.3797 1.9344 1.4154 2.9629 2.1753 1.3355 1.3387 2.8337 2.3123 2.3595 2.4059 1.9123 1.9392 1.2431 1.0697 1.0952 1.8597 1.6834 1.4594 1.5769 1.3728 1.4346 2.3736 1.6052 1.9276 3.5079 6.8456 2.2486 2.2711 1.1673 1.1619 2.4734 2.2617 5.9837 6.6965 7.1568 6.3090 6.3200 1.0622 1.0635 1.0959 1.1005 1.0875 1.0868 1.0886 1.0893 1.0948 1.0947 1.0991 1.0986 1.0673
irintensity: 0.1914 0.2772 0.0922 0.3032 3.3399 0.9025 0.1396 1.7272 3.1634 6.1662 1.3572 5.8564 51.9118 13.5193 11.0027 46.1642 4.2612 1.0316 1.4812 6.5737 8.8626 29.9785 11.6075 6.9552 5.4696 16.9757 29.8754 55.3717 52.4266 4.3477 8.0449 113.2488 13.9181 12.3150 7.0298 1.5372 14.6530 2.9577 0.6056 0.3163 3.4192 3.0979 1.1873 8.2728 0.1753 18.2166 8.6988 0.9039 1.6620 0.2208 8.7161 1.3506 22.6114 61.2442 6.7177 9.5991 4.4599 4.4822 1.3194 1.7393 7.5647 2.9085 14.8549 12.7264 5.1678 18.3067 2.5382 0.6659 0.8417 7.4508 0.5055 20.3627 19.2243 40.9171 27.2684 9.7795 5.4971 10.9981 12.9972 34.8726 20.9339 21.0653 16.0747 55.1601
temp: 298.150 k
press: 1.00000 atm
elementType: 8 7 6 6 6 6 6 6 6 6 6 6 6 6 6 6 6 1 1 1 1 1 1 1 1 1 1 1 1 1
symmnumber: 1
zpe: 625153.9 jmol-1
zpe.correction: 0.238109 hartree
zpe.thermalcorrener: 0.251567 hartree
zpe.thermalcorrenthalpy: 0.252511 hartree
zpe.thermalcorrgfe: 0.198207 hartree
zpe.sumelectzpe: -708.144119 hartree
zpe.sumelectthermal: -708.130661 hartree
zpe.sumelectthermalent: -708.129717 hartree
zpe.sumelectthermalfe: -708.184021 hartree
dipole: 0.0966 -0.8871 -0.0322
dipole: 0.8929
quadrupole: -91.5337 -84.1033 -99.2922
quadrupole: -0.2711 0.1177 -2.0799
quadrupole: 0.1094 7.5398 -7.6491 -0.2711 0.1177 -2.0799
hfenergy: -708.3822274 hartree
pointgroup: C01 [X(C15H13N1O1)]
dipole: -0.0392698 -0.3484861 0.0205857 debye
polarizability: 221.1305041|0.7762899|183.7760172|0.9494617|3.5974696|105.8808179 unknown
InChI: InChI=1S/C15H13NO/c17-16-15-13-7-3-1-5-11(13)9-10-12-6-2-4-8-14(12)15/h1-8,17H,9-10H2
charge 0 multiplicity 1
30 atoms
O  1.265655 2.782928 -1.165671
N  -0.058841 2.192338 -0.95375
C  -0.688518 -2.099135 -0.567657
C  0.585677 -1.681033 -1.340352
C  -1.641244 -0.987603 -0.119764
C  1.578748 -0.974927 -0.437054
C  -1.33609 0.408463 -0.059927
C  1.278091 0.327549 0.046929
C  0.008244 1.002224 -0.368856
C  -2.95054 -1.405167 0.243717
C  2.781476 -1.600026 -0.030127
C  -2.357782 1.319881 0.345315
C  2.182817 0.982422 0.920192
C  -3.947509 -0.498061 0.649505
C  3.675901 -0.951514 0.850377
C  -3.647409 0.883301 0.69366
C  3.372229 0.343671 1.329111
H  -0.377287 -2.681683 0.324788
H  -1.268275 -2.799676 -1.200226
H  0.301618 -1.031202 -2.191279
H  1.05049 -2.588897 -1.766869
H  -3.186382 -2.475895 0.192936
H  3.016245 -2.602083 -0.409389
H  -2.105928 2.383513 0.387668
H  1.951956 1.992356 1.271453
H  -4.943992 -0.861108 0.924527
H  4.602656 -1.449133 1.157476
H  -4.406601 1.608438 1.006185
H  4.061095 0.855948 2.009628
H  1.035399 3.609213 -1.664646
