program: Gaussian 09
title: 000184553
version: EM64L-G09RevD.01
frameworkgroup: C1[X(C15H12ClN3O2S)]
method: RPBEPBE
basis: SDD
operation: Freq
keyword: #p
keyword: freq=noraman
keyword: PBEPBE/SDD
title: #p freq=noraman PBEPBE/SDD
converged: YES YES NO NO
title: Mulliken charges:
elementType: Cl S O O N N N C C C C C C C C C C C C C C C H H H H H H H H H H H H
charge: -0.051159 0.380650 -0.266575 -0.214394 -0.489689 -0.505896 -0.329278 0.392012 -0.407217 0.230842 -0.283693 -0.237973 0.493512 -0.127699 -0.221689 0.273264 -0.437943 -0.336413 0.317604 -0.331395 -0.343602 -0.537892 0.229115 0.254525 0.298560 0.263565 0.287529 0.215781 0.304072 0.251109 0.242223 0.221997 0.244150 0.221997
chargesum: 0.00000
title: Mulliken charges with hydrogens summed into heavy atoms:
elementType: Cl S O O N N N C C C C C C C C C C C C C C C
charge: -0.051159 0.380650 -0.266575 -0.214394 -0.191128 -0.218367 -0.329278 0.392012 -0.407217 0.230842 -0.054577 0.016552 0.493512 -0.127699 0.041876 0.273264 -0.222163 -0.032341 0.317604 -0.080286 -0.101379 0.150251
polarizability: 3.88013468e+02 -1.13247336e+00 2.49694116e+02 3.69656048e-03 -2.14205908e-02 8.60899142e+01
1716.lowfreq: -16.7003 -0.0009 0.0009 0.0015 2.0171 5.9508 8.2987 24.4777 39.6346
frequency: -16.6879 24.4650 39.6247 53.5699 59.5582 90.4573 96.6161 100.0243 159.6525 162.1380 180.6955 192.9489 238.6963 244.2656 249.7019 297.6530 300.0026 312.1128 335.9397 346.1768 412.6217 416.3385 419.1883 422.1902 443.0507 501.2257 506.9202 520.9117 525.1114 554.3668 573.7566 582.5948 629.2321 642.4463 668.3583 696.0323 696.8788 719.7472 734.5385 753.3140 777.6196 809.4710 811.3921 826.0601 833.7518 849.6509 906.9048 935.6523 954.4983 969.0541 969.1073 988.6807 1001.4696 1034.6984 1073.6517 1114.3667 1116.0722 1121.8172 1147.6841 1159.0549 1166.5038 1184.0172 1223.9934 1252.7493 1262.2544 1287.2029 1309.6101 1371.6431 1388.4852 1403.6065 1420.2938 1421.7262 1438.5236 1467.5783 1473.7724 1482.5148 1501.3908 1503.1929 1518.7590 1568.2675 1590.0368 1597.8046 1631.2177 1668.2801 2959.2272 3046.5698 3109.8882 3124.5058 3140.5649 3156.7677 3159.4476 3169.7696 3179.8390 3195.4634 3524.0729 3547.7832
redmass: 4.7052 6.8955 8.9974 5.3844 4.6417 7.8270 3.4282 7.2641 4.3520 3.1718 9.5533 6.2823 2.2408 1.6283 5.1466 9.7415 6.6574 20.5681 5.6418 2.8281 2.7834 2.8202 7.4125 2.6306 5.3289 5.4180 4.3532 10.4401 2.4151 8.9893 8.2460 1.2273 7.1178 5.2958 8.4730 6.9718 11.5015 3.6784 4.9077 6.3471 7.8660 1.3276 1.3422 6.7461 1.5781 1.5923 7.0712 1.3694 1.3393 8.1038 1.3254 7.5993 2.8129 6.6586 1.9999 1.2590 2.0057 2.2522 1.3669 1.3308 2.3065 1.2301 2.4953 1.6025 2.4590 2.3831 1.5024 5.0773 7.0986 3.6261 3.5237 3.4653 1.1789 1.0497 1.1295 4.2682 2.1309 2.2378 2.3223 6.2690 7.1434 5.2467 6.4576 4.6458 1.0330 1.1039 1.0899 1.0994 1.0919 1.0892 1.0897 1.0945 1.0971 1.0947 1.0764 1.0758
irintensity: 1.3848 0.7863 0.2094 9.3692 0.9474 1.3961 6.9611 2.8865 0.0300 1.6853 2.3882 1.7496 2.1950 1.1599 0.8223 6.5171 0.9033 1.3432 0.8046 4.2642 0.0009 0.8741 18.0312 3.6764 5.8973 46.0765 2.8151 12.1429 49.1669 12.2088 8.5499 149.5912 3.4838 0.0014 21.9918 0.2008 17.0430 0.0128 8.4467 17.6026 18.9043 18.6272 36.9814 7.9829 90.5752 27.5625 9.9107 0.3004 0.0132 46.1188 4.3107 22.7957 15.7190 31.3098 24.1863 0.1743 23.7528 25.6544 61.1527 0.3856 507.2412 20.6450 271.6979 9.8590 10.3612 10.8555 24.2378 110.5877 58.7118 16.8720 43.9852 195.3846 42.0719 13.3940 192.6455 831.8985 624.5157 42.4880 43.7900 9.5831 10.5619 13.8845 7.7189 148.0431 75.3184 50.0206 22.5540 28.1422 6.5457 1.4872 11.4677 6.2799 3.2819 7.4151 7.4566 12.2062
temp: 298.150 k
press: 1.00000 atm
elementType: 17 16 8 8 7 7 7 6 6 6 6 6 6 6 6 6 6 6 6 6 6 6 1 1 1 1 1 1 1 1 1 1 1 1
symmnumber: 1
zpe: 638513.4 jmol-1
zpe.correction: 0.243197 hartree
zpe.thermalcorrener: 0.262403 hartree
zpe.thermalcorrenthalpy: 0.263348 hartree
zpe.thermalcorrgfe: 0.193994 hartree
zpe.sumelectzpe: -1750.059499 hartree
zpe.sumelectthermal: -1750.040293 hartree
zpe.sumelectthermalent: -1750.039349 hartree
zpe.sumelectthermalfe: -1750.108702 hartree
dipole: -0.8254 3.0165 -0.0011
dipole: 3.1274
quadrupole: -108.7656 -145.9994 -147.7553
quadrupole: -1.8537 0.0064 -0.0108
quadrupole: 25.4079 -11.8260 -13.5819 -1.8537 0.0064 -0.0108
hfenergy: -1750.3026962 hartree
pointgroup: C01 [X(C15H12Cl1N3O2S1)]
dipole: 0.2850208 -1.196942 0.0002287 debye
polarizability: 387.7844414|-5.7365928|249.9231185|0.0250145|-0.0647206|86.0899387 unknown
InChI: InChI=1S/C15H12ClN3O2S/c1-21-11-5-3-10(4-6-11)17-15(20)18-14-12-8-9(16)2-7-13(12)22-19-14/h2-8,17-18H,1H3
charge 0 multiplicity 1
34 atoms
Cl 5.44663 -3.371823 0.002556
S  3.798659 2.80691 -0.001501
O  -6.997741 -0.554097 -0.000069
O  -0.73142 1.770148 -0.000829
N  0.924468 0.080137 -0.001001
N  -1.331797 -0.511746 -0.001175
N  2.068881 2.202471 -0.001755
C  3.40326 0.183572 -0.000149
C  4.468693 1.13135 -0.000351
C  2.093686 0.857398 -0.000971
C  3.699016 -1.204516 0.000752
C  5.819501 0.720173 0.000313
C  -2.75777 -0.427272 -0.000869
C  5.045159 -1.593855 0.001388
C  6.110125 -0.65874 0.001182
C  -0.420378 0.553945 -0.001229
C  -3.480697 -1.652767 -0.000757
C  -3.473022 0.795524 -0.000698
C  -5.597689 -0.435378 -0.000325
C  -4.884142 -1.659954 -0.000492
C  -4.885705 0.787839 -0.000427
C  -7.776539 0.685959 0.000107
H  2.917238 -1.971798 0.000995
H  6.634916 1.449376 0.000159
H  1.079588 -0.928943 -0.000722
H  7.145701 -1.009676 0.001704
H  -0.96723 -1.466552 -0.001409
H  -2.941867 -2.609681 -0.000881
H  -2.924101 1.738545 -0.00079
H  -5.446304 -2.598279 -0.000409
H  -5.412403 1.746674 -0.000305
H  -7.570986 1.291059 0.904723
H  -8.82859 0.365112 0.000307
H  -7.571341 1.291089 -0.90457
