program: Gaussian 09
title: 000184549
version: EM64L-G09RevD.01
frameworkgroup: C1[X(C11H12ClN3OS)]
method: RPBEPBE
basis: SDD
operation: Freq
keyword: #p
keyword: freq=noraman
keyword: PBEPBE/SDD
title: #p freq=noraman PBEPBE/SDD
converged: YES YES NO NO
title: Mulliken charges:
elementType: Cl S O N N N C C C C C C C C C C C H H H H H H H H H H H H
charge: -0.054133 0.379969 -0.231378 -0.408149 -0.497692 -0.339224 -0.016206 0.395477 0.226206 -0.702856 -0.666529 -0.391116 0.274758 -0.339849 -0.237554 -0.105814 -0.214112 0.245595 0.285898 0.225693 0.199319 0.231806 0.264005 0.210867 0.194192 0.306419 0.249406 0.252843 0.262157
chargesum: 0.00000
title: Mulliken charges with hydrogens summed into heavy atoms:
elementType: Cl S O N N N C C C C C C C C C C C
charge: -0.054133 0.379969 -0.231378 -0.122251 -0.191273 -0.339224 0.229388 0.395477 0.226206 -0.046037 0.002536 -0.391116 0.274758 -0.090442 0.015289 -0.105814 0.048045
polarizability: 2.42969435e+02 -4.66652478e+00 1.99005575e+02 -1.89513518e+00 -3.75279578e+00 8.74161094e+01
1716.lowfreq: -4.3166 -0.0023 -0.0022 -0.0015 0.6639 5.3168 22.2552 31.0364 48.5776
frequency: 22.0535 31.0279 48.5737 63.8757 92.3155 98.0516 148.2402 177.9022 189.2771 218.8664 234.1957 252.3877 260.1856 294.5876 311.5408 316.5347 354.1740 397.2313 416.9305 421.8123 438.6917 466.7819 487.1675 506.1875 533.6405 551.2122 579.2596 640.6996 682.8996 689.8833 696.8516 733.7666 772.1033 810.2582 836.3265 866.4526 881.7950 920.0386 929.9024 949.2255 952.8901 991.4066 1037.1312 1067.1123 1124.1074 1142.6699 1145.2925 1151.1676 1183.2910 1201.7068 1250.4130 1286.1235 1307.8939 1346.2410 1376.6811 1387.5717 1394.4503 1403.3952 1416.0820 1454.0900 1464.1127 1468.3645 1476.3725 1481.1203 1487.1816 1487.9390 1565.2949 1588.6458 1664.3287 2974.6216 2979.9592 3029.4731 3067.8621 3079.7332 3093.0327 3099.4950 3151.6286 3155.5759 3178.4089 3526.6514 3543.2928
redmass: 3.7358 5.2012 3.9723 5.6431 4.7727 9.9467 4.4628 7.5355 4.3804 1.0493 4.7193 1.8487 2.0787 7.3113 14.6379 4.9861 2.1327 2.3221 2.4377 2.5898 2.9537 2.7648 1.5424 4.1140 8.1148 8.6339 6.5375 5.5246 7.9102 8.6454 7.1353 5.3551 7.5498 1.3476 2.7729 1.5586 4.1889 1.2689 2.2254 1.7455 1.3437 3.5455 5.6985 1.9642 3.6184 2.1509 1.6227 1.5928 2.1109 2.2768 1.3773 2.4796 1.6320 1.2824 1.2170 6.1050 1.2318 3.2775 3.0643 1.4763 1.1225 1.0504 2.8571 1.7400 1.0612 1.7325 7.4897 7.2871 7.0289 1.0379 1.0367 1.0852 1.0978 1.0981 1.0999 1.1000 1.0925 1.0892 1.0970 1.0771 1.0762
irintensity: 2.3270 0.5330 1.6896 9.7754 1.1070 0.4870 2.4047 1.9051 2.3925 0.0341 2.7690 1.4675 3.7109 1.3143 0.9485 9.3316 5.9830 23.2772 2.9176 24.5754 4.7936 4.8501 142.7528 61.1148 15.7298 10.3112 14.0084 1.9283 8.3989 23.5144 2.6254 10.4484 32.8492 38.9967 1.5419 16.1879 15.1207 5.2390 0.6524 0.8660 0.0075 43.3873 21.9400 25.3927 5.7353 42.4046 25.2310 8.3521 21.9989 411.6340 11.7324 5.2831 19.2450 11.1544 26.4770 28.0823 45.5877 13.5435 124.0347 275.3310 86.8950 3.3289 605.8263 31.3372 26.8879 14.2964 5.7715 11.1224 196.1770 23.0303 33.2049 0.5483 8.9203 71.2350 29.9732 27.2513 2.1795 1.3807 3.4983 16.0835 14.7864
temp: 298.150 k
press: 1.00000 atm
elementType: 17 16 8 7 7 7 6 6 6 6 6 6 6 6 6 6 6 1 1 1 1 1 1 1 1 1 1 1 1
symmnumber: 1
zpe: 565269.7 jmol-1
zpe.correction: 0.215300 hartree
zpe.thermalcorrener: 0.232348 hartree
zpe.thermalcorrenthalpy: 0.233292 hartree
zpe.thermalcorrgfe: 0.168449 hartree
zpe.sumelectzpe: -1522.737062 hartree
zpe.sumelectthermal: -1522.720014 hartree
zpe.sumelectthermalent: -1522.719070 hartree
zpe.sumelectthermalfe: -1522.783913 hartree
dipole: -0.1434 3.5373 -2.6992
dipole: 4.4518
quadrupole: -94.5739 -118.7370 -118.1380
quadrupole: 19.4008 -6.5967 -0.3259
quadrupole: 15.9091 -8.2541 -7.6550 19.4008 -6.5967 -0.3259
hfenergy: -1522.9523619 hartree
pointgroup: C01 [X(C11H12Cl1N3O1S1)]
dipole: 0.0300467 -1.676698 -0.5054734 debye
polarizability: 242.2364604|-3.822114|187.9990003|8.6101307|-34.1056236|99.1556591 unknown
InChI: InChI=1S/C11H12ClN3OS/c1-6(2)13-11(16)14-10-8-5-7(12)3-4-9(8)17-15-10/h3-6,13-14H,1-2H3
charge 0 multiplicity 1
29 atoms
Cl 4.011088 -2.923383 1.233509
S  1.718595 2.593535 -1.058466
O  -2.42403 1.245409 0.687052
N  -3.125216 -0.836832 -0.122588
N  -0.854045 -0.286052 -0.22851
N  0.084341 1.796169 -0.925619
C  -4.544661 -0.639071 0.2591
C  1.615627 0.10481 -0.144471
C  0.248701 0.558413 -0.427527
C  -5.211924 -2.012388 0.468993
C  -5.289686 0.225964 -0.785173
C  2.571665 1.114181 -0.462017
C  -2.171768 0.141764 0.139352
C  2.048411 -1.137936 0.385105
C  3.954457 0.900675 -0.273505
C  3.424958 -1.334874 0.55731
C  4.384459 -0.341886 0.234801
H  -4.524673 -0.08446 1.214852
H  -2.918219 -1.576907 -0.797401
H  -6.260447 -1.880278 0.788296
H  -5.223953 -2.59957 -0.47062
H  -4.684575 -2.598728 1.242188
H  -4.774429 1.192963 -0.91206
H  -6.3254 0.424649 -0.45375
H  -5.334243 -0.286379 -1.765041
H  -0.675993 -1.291211 -0.265542
H  1.338007 -1.9186 0.67525
H  4.688748 1.675368 -0.513231
H  5.448804 -0.541243 0.387712
