program: Gaussian 09
title: 000184547
version: EM64L-G09RevD.01
frameworkgroup: C1[X(C10H10ClN3OS)]
method: RPBEPBE
basis: SDD
operation: Freq
keyword: #p
keyword: freq=noraman
keyword: PBEPBE/SDD
title: #p freq=noraman PBEPBE/SDD
converged: NO YES NO NO
title: Mulliken charges:
elementType: Cl S O N N N C C C C C C C C C C H H H H H H H H H H
charge: -0.055016 0.371359 -0.219103 -0.488265 -0.413308 -0.325884 0.388035 0.229020 -0.408244 -0.281946 -0.235710 -0.334584 -0.125507 -0.224459 0.312428 -0.634780 0.229294 0.293441 0.253629 0.215227 0.215266 0.262718 0.282286 0.245892 0.245793 0.202418
chargesum: 0.00000
title: Mulliken charges with hydrogens summed into heavy atoms:
elementType: Cl S O N N N C C C C C C C C C C
charge: -0.055016 0.371359 -0.219103 -0.194825 -0.131022 -0.325884 0.388035 0.229020 -0.408244 -0.052652 0.017919 0.095909 -0.125507 0.038259 0.312428 0.059323
polarizability: 2.32050468e+02 3.57408959e+00 1.93676046e+02 -4.45140374e-02 4.51906505e-02 6.97492591e+01
1716.lowfreq: -111.0299 -43.2422 -5.7924 -2.2062 0.0004 0.0008 0.0024 5.1371 35.2977
frequency: -111.0177 -43.1179 35.2211 63.6801 66.3968 90.3846 143.6491 153.6401 235.3591 240.0195 251.0787 279.7665 298.1302 305.1865 316.9665 360.1225 401.5932 417.6040 437.7761 502.9113 517.8902 551.1828 560.6215 566.2077 641.1944 691.8381 696.8186 704.4532 732.2410 764.2625 797.2128 810.0526 831.9884 847.4888 914.4428 949.1616 952.7632 1028.2115 1071.8750 1073.6190 1104.7826 1141.0988 1141.2534 1153.9436 1217.4227 1253.7971 1289.2019 1289.6265 1342.4926 1388.6784 1401.5233 1401.7711 1421.1452 1463.6300 1471.6256 1484.4344 1487.0674 1503.2285 1527.6459 1568.3203 1589.5120 1682.8911 2954.8746 2994.9909 3002.8817 3101.8061 3134.2781 3145.0809 3156.9180 3179.5700 3524.8346 3545.4646
redmass: 2.1954 3.1396 4.4424 6.4156 3.2482 8.0919 6.8260 3.9803 4.7752 5.9402 8.5495 1.1175 6.0410 9.7640 9.8709 1.7936 5.2809 2.8910 4.8571 4.2830 11.6011 8.9433 1.2402 8.9290 5.2891 7.1606 11.2927 5.9656 4.8915 6.8337 1.1169 1.3417 5.8730 1.6033 4.7807 3.2656 1.3403 5.9400 4.1890 2.0280 2.1949 1.8662 1.5187 1.9176 2.6480 1.4611 2.8685 1.0947 1.3084 6.7685 1.7757 1.8379 3.0494 1.0404 1.1190 2.1828 1.7479 1.8566 1.4520 6.2220 7.2481 5.3508 1.0577 1.1053 1.0402 1.0952 1.1014 1.0919 1.0891 1.0972 1.0764 1.0756
irintensity: 0.8935 4.9881 0.2406 2.0729 8.2692 0.6460 0.1952 0.2039 1.8390 2.2885 2.7392 0.2109 0.4232 11.1483 3.7198 7.7341 14.1813 2.6116 1.7096 1.0940 2.0891 20.1592 220.5854 24.4810 0.0007 5.2830 15.3898 11.1262 9.4486 10.7183 1.7379 37.3977 25.0240 25.8835 3.6715 27.1232 0.0147 33.6588 51.5404 24.1516 0.5302 48.9323 7.1831 29.3383 339.4593 38.9460 3.2760 0.3096 200.2031 33.8348 18.2665 32.1517 128.4046 11.0119 157.3428 360.1378 36.9851 201.1382 78.5304 6.5716 7.9236 185.3013 80.4337 39.3099 43.5424 36.7706 23.5118 6.0090 1.3545 3.2250 6.4674 10.9204
temp: 298.150 k
press: 1.00000 atm
elementType: 17 16 8 7 7 7 6 6 6 6 6 6 6 6 6 6 1 1 1 1 1 1 1 1 1 1
symmnumber: 1
zpe: 492674.9 jmol-1
zpe.correction: 0.187650 hartree
zpe.thermalcorrener: 0.201792 hartree
zpe.thermalcorrenthalpy: 0.202736 hartree
zpe.thermalcorrgfe: 0.145237 hartree
zpe.sumelectzpe: -1483.500500 hartree
zpe.sumelectthermal: -1483.486358 hartree
zpe.sumelectthermalent: -1483.485414 hartree
zpe.sumelectthermalfe: -1483.542913 hartree
dipole: -1.1466 -4.8139 -0.0049
dipole: 4.9485
quadrupole: -97.4585 -106.4455 -110.9451
quadrupole: -25.2966 -0.0201 0.0229
quadrupole: 7.4912 -1.4958 -5.9954 -25.2966 -0.0201 0.0229
hfenergy: -1483.6881498 hartree
pointgroup: C01 [X(C10H10Cl1N3O1S1)]
dipole: 0.3246962 -1.9196418 -0.0001162 debye
dipolederiv: -0.2678101 0.2328156 0.0003876 0.3790418 -0.7130777 -0.0008797 0.0005315 -0.000758 -0.065184 -0.4428797 -0.1758198 0.000377 0.0273941 -0.1250259 -0.0003229 0.000819 0.0000392 0.1294579 -0.9733493 0.0952251 0.0000746 0.0764769 -0.7932924 -0.0005053 -0.0007573 0.0018993 -0.3085877 -2.1648431 -0.5634924 -0.0002744 -0.3912877 -0.4701167 0.0005084 0.0011255 0.0006457 -0.3625595 -1.1631502 -0.4773634 0.0007758 -0.7824444 -0.804878 -0.0000322 -0.0004407 -0.0007649 -0.5177854 0.3167308 0.5328768 -0.0000876 -0.2493285 -0.3073842 0.0002315 -0.000599 -0.0007495 -0.2780855 -0.2815743 -0.2711992 0.0001144 0.1343352 -0.1570227 -0.000387 0.0005573 0.000156 0.0624636 1.2705738 0.469668 -0.000666 1.0768609 0.4772143 -0.0004906 -0.0009535 -0.0003793 0.1508032 -0.0893457 -0.3401324 -0.000315 -0.4096014 0.4225096 0.0008526 -0.0003975 0.0007416 -0.1315318 -0.0011166 0.1724719 0.0000054 0.0321179 -0.2234762 -0.0001095 -0.0000252 -0.000239 -0.1133438 0.0861166 0.1348285 -0.0000982 0.1826488 -0.0532377 -0.0001967 -0.000055 -0.0001286 -0.0804801 0.88666 0.2669357 0.0003079 0.0997893 0.1744385 0.0003401 0.0006358 0.0004316 0.3658642 0.2003791 -0.4593097 -0.000651 -0.5664818 1.0165744 0.0013935 -0.0007351 0.0013772 -0.0727203 -0.0588853 0.1277224 0.0000062 0.1352147 -0.1390478 -0.0001532 0.0000303 -0.0001766 -0.1090148 2.6858771 0.4491596 -0.0001819 0.3586171 1.4286919 -0.0000536 -0.0000341 -0.0017233 0.3018031 -0.0317037 0.0635599 -0.0001953 0.0603729 -0.0336317 0.0003205 -0.000316 0.0003288 0.0434555 0.0173773 -0.0975933 0.0001392 -0.0904197 0.0089055 -0.0000464 0.0000781 -0.0000119 0.1646233 0.1410422 0.0160775 0.0000979 0.0571595 0.0742507 -0.0000298 0.0006815 0.0000208 0.3092358 0.0394951 -0.0320076 0.0001239 -0.0816863 -0.0122227 -0.0000283 0.0001082 -0.0000889 0.1630949 -0.1077645 -0.0680523 -0.0153537 -0.0611519 -0.0375572 -0.1149465 -0.0819541 -0.1567253 -0.085712 -0.1083816 -0.0688793 0.0159055 -0.0616158 -0.0368907 0.1146219 0.0823551 0.156365 -0.0861904 -0.035379 0.0220711 0.0002562 0.0462845 0.0957089 -0.0001077 0.0002552 -0.0000814 0.1667188 0.0273574 0.064069 -0.0009655 0.0838763 0.1053888 0.0002515 -0.0010727 0.0001876 0.339532 0.1436877 -0.0168014 -0.0430895 0.0286188 0.0212253 -0.0834051 -0.0477497 -0.0830148 -0.0479195 0.1431216 -0.0171354 0.0440514 0.0282546 0.0216192 0.0833682 0.048704 0.0827427 -0.048108 -0.232236 -0.0596948 -0.0007448 -0.1130454 0.0603345 -0.0001937 -0.0007919 -0.0000938 0.1101705 unknown
polarizability: 231.4098768|-6.0781319|194.3165539|-0.0964538|0.0858588|69.7493416 unknown
InChI: InChI=1S/C10H10ClN3OS/c1-2-12-10(15)13-9-7-5-6(11)3-4-8(7)16-14-9/h3-5,12-13H,2H2,1H3
charge 0 multiplicity 1
26 atoms
Cl 3.862677 -2.967486 -0.004407
S  1.257614 2.872164 0.003013
O  -3.048374 1.115382 0.001158
N  -1.144079 -0.283142 0.004129
N  -3.269496 -1.239953 0.003651
N  -0.359419 1.999154 0.004525
C  1.28295 0.220486 0.001121
C  -0.119288 0.674483 0.003244
C  2.184676 1.324702 0.000808
C  1.795739 -1.102757 -0.000507
C  3.583502 1.132691 -0.00108
C  -4.74265 -1.428845 -0.000036
C  3.186405 -1.273389 -0.002332
C  4.090392 -0.182543 -0.002647
C  -2.557636 -0.038812 0.004803
C  -5.603631 -0.152272 -0.004295
H  1.14608 -1.984197 -0.000439
H  -0.824714 -1.252894 0.003547
H  4.272378 1.982448 -0.001335
H  -5.003848 -2.035735 -0.891696
H  -5.008646 -2.033088 0.892011
H  5.168599 -0.364151 -0.004105
H  -2.739916 -2.11403 0.005708
H  -5.418026 0.472289 0.882291
H  -5.413057 0.469694 -0.891678
H  -6.664731 -0.464697 -0.006851
