program: Gaussian 09
title: 000184546
version: EM64L-G09RevD.01
frameworkgroup: C1[X(C9H8ClN3OS)]
method: RPBEPBE
basis: SDD
operation: Freq
keyword: #p
keyword: freq=noraman
keyword: PBEPBE/SDD
title: #p freq=noraman PBEPBE/SDD
converged: YES YES NO NO
title: Mulliken charges:
elementType: Cl S O N N N C C C C C C C C C H H H H H H H H
charge: -0.053281 0.382136 -0.235386 -0.491666 -0.336449 -0.405635 0.396102 -0.390730 0.230637 -0.339973 -0.235344 -0.104338 -0.213021 0.292994 -0.598488 0.249995 0.253117 0.305239 0.262376 0.297453 0.228907 0.225311 0.280045
chargesum: 0.00000
title: Mulliken charges with hydrogens summed into heavy atoms:
elementType: Cl S O N N N C C C C C C C C C
charge: -0.053281 0.382136 -0.235386 -0.186427 -0.336449 -0.108182 0.396102 -0.390730 0.230637 -0.089978 0.017773 -0.104338 0.049355 0.292994 0.135775
polarizability: 2.11874323e+02 1.35255040e+00 1.76619565e+02 -4.39825320e+00 6.21991924e+00 6.99630369e+01
1716.lowfreq: -5.0063 -0.0030 -0.0022 -0.0016 2.3601 4.8247 28.0577 42.6055 65.9444
frequency: 28.0182 42.6018 65.9402 99.3209 108.2243 143.2417 160.3395 194.3959 236.5595 258.5923 287.5573 311.4606 315.4107 370.8028 398.0922 419.7743 437.7146 499.2187 511.9574 533.9768 552.3736 582.1171 642.7691 680.5564 692.4164 697.8859 733.4488 760.1795 810.8990 864.2789 868.0723 926.0299 953.7015 1023.6116 1065.8740 1073.7018 1126.6557 1137.3737 1139.0277 1153.0587 1201.3197 1249.8433 1289.2999 1387.8325 1404.0425 1416.8998 1425.0866 1454.5629 1478.3751 1482.0600 1487.1534 1512.9094 1565.3908 1589.4679 1675.5832 2978.9227 3058.0174 3112.2375 3151.0709 3155.5278 3177.5022 3539.7935 3556.1669
redmass: 5.2988 4.4236 5.5724 3.2608 1.4611 4.1031 4.6589 5.6575 6.3405 8.0007 6.2309 14.2985 5.9845 5.5800 1.4048 2.9494 4.3587 2.4517 1.9519 5.7918 8.5843 7.7635 5.5174 5.3056 9.2311 7.2219 5.3304 6.6273 1.3466 2.1376 3.0469 4.6241 1.3417 7.1288 1.9296 6.3177 1.2837 1.5928 2.2706 1.6917 2.1471 1.3664 2.9770 6.2300 3.3221 3.1269 1.1565 1.3765 2.6332 3.1876 1.1065 1.3777 7.4654 7.3013 6.6266 1.0353 1.1027 1.0979 1.0926 1.0890 1.0973 1.0765 1.0772
irintensity: 7.7375 4.2866 4.1470 1.0586 0.6669 0.8289 0.5492 4.3502 2.7773 1.0433 2.1146 2.6092 5.3867 34.2525 25.6383 11.1651 0.6438 47.3150 158.6058 35.8001 9.9358 11.4403 3.0008 8.6944 13.5809 4.9289 10.8739 34.0987 39.4243 11.8917 28.3164 1.5240 0.0114 31.9811 28.3726 25.6482 0.6671 55.2787 12.9129 4.1725 370.2707 12.8442 4.4965 23.4924 15.7118 121.3091 28.2369 222.9179 415.3824 73.0657 38.3267 162.9855 6.5756 11.1334 197.1150 90.1018 37.8696 2.0647 2.0029 1.2672 3.4759 7.1667 25.6192
temp: 298.150 k
press: 1.00000 atm
elementType: 17 16 8 7 7 7 6 6 6 6 6 6 6 6 6 1 1 1 1 1 1 1 1
symmnumber: 1
zpe: 420226.0 jmol-1
zpe.correction: 0.160056 hartree
zpe.thermalcorrener: 0.174416 hartree
zpe.thermalcorrenthalpy: 0.175360 hartree
zpe.thermalcorrgfe: 0.116869 hartree
zpe.sumelectzpe: -1444.283654 hartree
zpe.sumelectthermal: -1444.269293 hartree
zpe.sumelectthermalent: -1444.268349 hartree
zpe.sumelectthermalfe: -1444.326841 hartree
dipole: -1.0597 -3.4828 -2.8142
dipole: 4.6014
quadrupole: -91.3261 -98.4832 -104.3460
quadrupole: -23.9074 -9.6807 3.1967
quadrupole: 6.7257 -0.4315 -6.2942 -23.9074 -9.6807 3.1967
hfenergy: -1444.4437095 hartree
pointgroup: C01 [X(C9H8Cl1N3O1S1)]
dipole: 0.3436759 -1.5197848 0.9216143 debye
dipolederiv: -0.3022509 0.256816 0.0504016 0.3913605 -0.659601 -0.1059894 0.0734442 -0.099818 -0.0825819 -0.3202678 -0.166749 0.0144388 -0.0011933 -0.118306 -0.044283 0.1025706 0.01103 0.1383734 -0.8612364 -0.0171286 -0.1139639 0.0741487 -0.5835476 0.3077129 -0.1458897 0.2856769 -0.6199807 -1.984446 -0.5709906 -0.1223472 -0.4415709 -0.465323 -0.0355237 -0.2381856 -0.0691856 -0.4744992 0.094978 0.5372768 0.0432634 -0.1583281 -0.2400627 0.0022492 -0.006581 -0.0543587 -0.2735264 -1.1665706 -0.3710367 0.1634436 -0.5976479 -0.8375071 0.027706 0.2076289 0.0236029 -0.3912229 -0.3178954 -0.2664474 -0.0176067 0.0853223 -0.1561254 -0.0339986 -0.0244316 -0.0458711 0.0541298 -0.0202307 -0.3647135 -0.0426446 -0.3741609 0.3503142 0.0767729 -0.052078 0.0575717 -0.1185821 1.1813853 0.4609857 -0.0307659 1.0124463 0.5071669 0.0774269 -0.1348126 0.0028906 0.1281535 -0.0139713 0.1855603 0.0234661 0.0253113 -0.2136936 -0.0104095 0.0337115 -0.0178354 -0.1066653 0.064849 0.1385442 0.0014909 0.1886536 -0.0412798 -0.0097865 0.0025667 0.0011264 -0.0817433 0.273912 -0.5034792 -0.0930178 -0.5947071 0.9378042 0.1749472 -0.1139446 0.1835695 -0.0390846 -0.0709174 0.1326374 0.0122673 0.1310602 -0.123884 -0.013829 0.0143031 -0.0180958 -0.1123797 2.6189834 0.6651384 0.1672242 0.3354122 0.9716934 -0.5820176 0.1498776 -0.5173682 0.7815867 0.6020658 0.1501244 -0.0241158 -0.0299594 0.1398762 0.1284316 0.1597658 0.2035819 0.1293554 0.0535565 -0.0838308 0.0047713 -0.0649182 0.0139538 -0.0170302 -0.0032606 -0.0167912 0.1577904 0.0449711 -0.0307774 0.0053495 -0.0796994 -0.0175298 -0.0142045 0.0021493 -0.0157418 0.1612443 0.0948096 -0.0246152 -0.0663762 0.0282792 0.1166081 0.057788 0.0265492 0.0944253 0.3142209 -0.0363948 0.0116349 0.0180213 0.036077 0.0993545 -0.0111628 0.0195329 -0.008962 0.1632027 0.0977183 -0.0367621 -0.087696 0.0392034 0.2723334 0.0976268 -0.0967242 0.1095603 0.181395 -0.1494922 -0.0357382 0.0891506 0.0301393 0.0974921 -0.0602505 0.1423731 -0.0556935 -0.046977 -0.0441633 -0.0581521 -0.0111554 -0.1241882 -0.1363334 -0.1019353 -0.0613493 -0.1023222 0.0896542 0.1606078 -0.0082973 0.0164008 0.0889592 0.0865962 0.0897591 -0.0572155 0.0490081 0.0481367 unknown
polarizability: 211.4319563|-2.781653|176.73141|-6.8800466|7.4483434|70.2935581 unknown
InChI: InChI=1S/C9H8ClN3OS/c1-11-9(14)12-8-6-4-5(10)2-3-7(6)15-13-8/h2-4,11-12H,1H3
charge 0 multiplicity 1
23 atoms
Cl 3.637616 -2.816194 -0.522252
S  0.684075 2.786838 0.384526
O  -3.214974 0.574877 -0.99669
N  -1.526475 -0.484719 0.292801
N  -0.845384 1.798174 0.456839
N  -3.713439 -1.310051 0.306068
C  0.885072 0.156581 0.102654
C  1.713148 1.316031 0.160769
C  -0.530138 0.504457 0.274419
C  1.467054 -1.11886 -0.113931
C  3.114957 1.224496 0.021088
C  2.860389 -1.1911 -0.242699
C  3.693834 -0.045782 -0.175068
C  -2.863908 -0.321494 -0.189387
C  -5.104494 -1.410856 -0.149117
H  0.855174 -2.022153 -0.203116
H  3.751435 2.113354 0.062003
H  -1.239732 -1.417369 0.595276
H  4.777033 -0.151653 -0.282428
H  -3.423692 -1.86147 1.114682
H  -5.815974 -1.166731 0.661837
H  -5.327473 -2.423152 -0.532994
H  -5.241602 -0.679324 -0.961083
