program: Gaussian 09
title: 000184545
version: EM64L-G09RevD.01
frameworkgroup: C1[X(C8H6ClN3OS)]
method: RPBEPBE
basis: SDD
operation: Freq
keyword: #p
keyword: freq=noraman
keyword: PBEPBE/SDD
title: #p freq=noraman PBEPBE/SDD
converged: NO NO NO NO
title: Mulliken charges:
elementType: Cl S O N N N C C C C C C C C H H H H H H
charge: -0.052803 0.377954 -0.217443 -0.452908 -0.323434 -0.659653 0.392546 -0.408113 0.233586 -0.284894 -0.232628 -0.122805 -0.222877 0.266362 0.230458 0.254528 0.263791 0.301106 0.351901 0.305326
chargesum: 0.00000
title: Mulliken charges with hydrogens summed into heavy atoms:
elementType: Cl S O N N N C C C C C C C C
charge: -0.052803 0.377954 -0.217443 -0.151802 -0.323434 -0.002426 0.392546 -0.408113 0.233586 -0.054436 0.021900 -0.122805 0.040914 0.266362
polarizability: 1.96442387e+02 -5.29457977e+00 1.70171429e+02 -1.66403450e-02 6.64919360e-02 5.15745319e+01
1716.lowfreq: -36.6575 -6.3538 -2.7450 -0.0013 -0.0013 0.0007 2.2013 52.7066 89.8156
frequency: -36.6485 52.6988 89.8147 90.7370 155.1674 181.3339 223.7238 270.5693 271.5993 306.0278 306.2392 348.3456 417.9004 424.8973 492.4713 512.5695 515.4641 538.3322 549.8044 565.4115 596.3099 643.0065 694.4210 712.7566 734.6350 754.9625 810.4840 849.4184 880.4664 917.4639 953.4592 1033.6809 1045.5063 1071.9767 1127.4849 1148.8826 1246.3431 1269.5431 1313.4298 1390.7630 1403.7376 1420.8990 1486.2750 1503.6800 1567.8690 1589.4613 1614.2353 1682.6320 3143.7166 3158.0346 3182.0157 3539.2007 3553.2004 3696.8596
redmass: 4.7923 4.0133 7.5078 7.9701 3.3532 12.5443 2.2473 8.1456 2.8240 14.9248 7.8412 5.7606 2.8953 6.2469 1.9933 1.5819 9.1711 5.8974 1.3279 6.1082 8.0468 5.3180 7.0924 9.0946 5.0509 9.0596 1.3427 1.6005 5.6815 4.5960 1.3414 6.7536 2.1139 1.9821 4.0557 1.3860 1.7165 1.6889 4.1221 7.7201 3.6951 3.0486 7.2705 2.1470 6.5089 7.1639 1.1916 4.8846 1.0923 1.0894 1.0969 1.0512 1.0707 1.1038
irintensity: 19.4926 2.6989 1.1627 5.4499 0.2708 3.9083 1.9563 2.2620 14.4500 2.3461 6.0187 6.0475 1.2035 5.1952 114.2132 256.3348 12.0697 18.2869 51.9288 23.6984 9.0135 0.0714 0.8093 26.4688 17.9106 30.4288 37.7716 25.6652 15.0875 22.3585 0.0069 23.7064 22.6396 23.5801 1.1498 6.3784 59.5453 131.7241 138.4383 37.0212 24.7997 125.3431 328.3319 443.9750 19.6371 12.1389 38.2815 271.3642 5.3682 1.3766 2.5733 38.6492 22.5704 44.9863
temp: 298.150 k
press: 1.00000 atm
elementType: 17 16 8 7 7 7 6 6 6 6 6 6 6 6 1 1 1 1 1 1
symmnumber: 1
zpe: 347215.6 jmol-1
zpe.correction: 0.132247 hartree
zpe.thermalcorrener: 0.144295 hartree
zpe.thermalcorrenthalpy: 0.145239 hartree
zpe.thermalcorrgfe: 0.093119 hartree
zpe.sumelectzpe: -1405.066935 hartree
zpe.sumelectthermal: -1405.054887 hartree
zpe.sumelectthermalent: -1405.053943 hartree
zpe.sumelectthermalfe: -1405.106063 hartree
dipole: 3.1299 -4.1347 -0.0226
dipole: 5.1858
quadrupole: -105.5321 -78.2942 -98.7109
quadrupole: 25.4483 0.0751 0.0430
quadrupole: -11.3530 15.8849 -4.5318 25.4483 0.0751 0.0430
hfenergy: -1405.1991824 hartree
pointgroup: C01 [X(C8H6Cl1N3O1S1)]
dipole: 0.9928424 -1.7823466 -0.0078823 debye
dipolederiv: -0.3713323 0.2929001 -0.000345 0.4220484 -0.6026286 0.000559 -0.0004654 0.0004986 -0.0642682 -0.3627278 -0.2068422 -0.0001305 -0.0100838 -0.1389055 0.0003164 -0.0005854 -0.0000245 0.1354737 -0.9945515 0.1052508 0.0014439 0.1508743 -0.7445242 -0.0013441 0.0041502 -0.0042498 -0.3424859 -1.8088483 -0.7286675 0.0021856 -0.5311736 -0.6464589 -0.0005669 0.0015294 0.0000098 -0.3579935 0.193329 0.6020221 -0.0003304 -0.118422 -0.2220128 -0.0002846 -0.0005178 0.0002868 -0.2800752 -0.7030382 -0.4761198 -0.0048046 -0.6732121 -1.077298 0.0009844 -0.0034363 0.0027592 -0.7861673 -0.2516081 -0.2806813 0.0000196 0.1146993 -0.179022 0.0002707 -0.0001561 0.0000683 0.0623279 0.0661419 -0.3995366 0.0002351 -0.4525216 0.2826088 -0.0004329 0.0003763 -0.0002677 -0.1325072 0.947698 0.5268163 0.0002863 1.0343327 0.6894 -0.0002453 0.0011573 0.0003921 0.1563713 -0.0412164 0.2064574 -0.0000979 0.0650552 -0.1815227 0.0000295 -0.0002831 0.0000337 -0.1133631 0.0262883 0.1465265 0.0000212 0.1952194 -0.0005186 0.0001058 -0.0000015 0.0000173 -0.0785139 0.3889807 -0.5694096 0.0005995 -0.6564662 0.8369639 -0.0008964 0.000693 -0.0009774 -0.0714065 -0.0956796 0.1373834 -0.0000458 0.1350452 -0.0990606 0.0000851 -0.0000521 0.000117 -0.1078492 2.4322847 0.6202307 -0.0028033 0.3102379 1.6058274 0.0039073 -0.0050967 0.0040051 0.3506925 0.0441999 -0.09092 -0.0001112 -0.0780783 -0.0188221 0.0000938 0.0000419 0.0000873 0.1668987 0.0588941 -0.0189937 -0.0000613 -0.0676895 -0.0271899 0.0000392 -0.0000677 0.0000641 0.1637862 -0.0380223 -0.0010737 -0.0001408 0.0226726 0.1031063 0.0000518 -0.0001176 0.0000408 0.1668812 0.1228087 0.0306822 0.0004905 0.0499182 0.1028194 -0.0003016 -0.0007767 -0.0007072 0.3208638 0.2329265 0.0444585 0.0012794 0.0233361 0.1822615 -0.0009335 0.0014748 -0.000667 0.4032168 0.1534727 0.0595164 0.0023097 0.0642081 0.1349767 -0.0014377 0.0021336 -0.0014865 0.408118 unknown
polarizability: 194.4725198|-8.712206|172.141334|-0.0083459|-0.0025327|51.5744939 unknown
InChI: InChI=1S/C8H6ClN3OS/c9-4-1-2-6-5(3-4)7(12-14-6)11-8(10)13/h1-3,11H,10H2
charge 0 multiplicity 1
20 atoms
Cl 3.571394 -2.552576 0.002868
S  0.019286 2.765795 -0.002169
O  -3.951659 0.304342 0.010211
N  -1.822393 -0.741803 -0.003038
N  -1.424322 1.634354 -0.003011
N  -3.788184 -2.018938 -0.000563
C  0.491398 0.155746 -0.000861
C  1.195289 1.39543 -0.000889
C  -0.965042 0.370131 -0.002138
C  1.218329 -1.063403 0.000345
C  2.606009 1.441666 0.000175
C  2.617691 -0.996911 0.00132
C  3.325941 0.229909 0.001236
C  -3.243646 -0.73174 -0.000329
H  0.725494 -2.041129 0.000736
H  3.142493 2.394879 0.000188
H  4.419132 0.231193 0.002044
H  -1.355816 -1.649618 -0.004315
H  -4.803461 -2.075387 0.005964
H  -3.250733 -2.882941 -0.008374
