program: Gaussian 09
title: 000184543
version: EM64L-G09RevD.01
frameworkgroup: C1[X(C11H13N3OS)]
method: RPBEPBE
basis: SDD
operation: Freq
keyword: #p
keyword: freq=noraman
keyword: PBEPBE/SDD
title: #p freq=noraman PBEPBE/SDD
converged: YES YES NO NO
title: Mulliken charges:
elementType: S O N N N C C C C C C C C C C C H H H H H H H H H H H H H
charge: 0.364701 -0.253793 -0.499232 -0.153087 -0.337190 0.395511 -0.393704 0.209424 -0.565668 0.471776 -0.257839 -0.355988 0.285474 -0.813961 -0.617134 -0.651644 0.227519 0.244960 0.235673 0.325923 0.232447 0.222661 0.235269 0.285872 0.226002 0.219701 0.224408 0.241454 0.250465
chargesum: 0.00000
title: Mulliken charges with hydrogens summed into heavy atoms:
elementType: S O N N N C C C C C C C C C C C
charge: 0.364701 -0.253793 -0.173308 -0.153087 -0.337190 0.395511 -0.393704 0.209424 -0.338149 0.471776 -0.012879 -0.120315 0.285474 -0.123584 0.114442 0.064683
polarizability: 2.26224603e+02 -9.35706585e-01 1.83132457e+02 3.07620327e+00 1.01048209e+00 8.84802563e+01
1716.lowfreq: -8.3206 -2.8027 -0.0009 0.0004 0.0011 3.5901 16.8413 37.6946 50.2058
frequency: 16.7000 37.6548 50.1346 64.7288 90.5908 115.0340 130.3272 143.3387 164.1074 192.7037 218.3115 239.8888 274.7037 304.9609 338.0748 365.5064 369.6410 416.7710 422.8408 457.9281 476.6333 509.6391 536.9476 586.4125 595.7941 626.4830 655.2542 694.1071 704.1268 742.6516 762.8159 817.2214 858.1228 881.5372 915.7172 961.8112 982.3127 1003.6674 1032.2162 1048.7727 1059.1974 1094.9373 1104.1350 1136.7614 1155.0353 1156.3687 1210.7451 1254.7998 1259.1530 1298.3949 1355.0899 1388.5704 1401.0351 1416.9979 1418.8322 1433.7257 1443.6863 1466.6109 1469.5125 1474.8031 1478.8040 1485.2143 1488.5411 1495.1009 1500.0973 1570.7619 1612.8578 1646.3568 2935.5563 2965.7138 2977.8297 3036.4727 3039.3398 3056.2361 3083.7049 3084.7615 3113.2381 3117.9961 3127.5916 3157.8121 3548.4196
redmass: 3.8689 3.3557 1.0874 3.8845 1.9943 3.7759 1.8710 1.2284 3.9302 4.5897 2.7346 5.1848 4.1127 4.5038 4.1736 6.6222 3.6093 2.3251 3.0518 1.7264 3.7468 4.0047 7.6418 6.6463 5.7104 6.2001 4.8558 10.1833 7.5018 4.5090 6.9762 1.3464 4.2434 1.5986 4.5390 1.3395 2.5193 1.6173 5.6524 1.5557 1.3815 1.2419 2.2929 1.3994 1.6896 1.6944 2.3385 4.6213 1.7963 2.2500 3.1461 4.8096 1.2704 2.8544 1.2782 3.1360 1.2000 1.8450 1.0557 1.1005 1.1657 1.4967 1.2054 1.8199 1.1316 6.4823 6.3551 7.0462 1.0464 1.0366 1.0373 1.0891 1.0992 1.0977 1.1006 1.0987 1.0913 1.0966 1.0886 1.0962 1.0760
irintensity: 3.2367 0.9164 0.3296 1.2369 6.7166 0.3056 0.1087 0.3622 1.2928 1.2897 8.0161 2.3768 1.4997 1.5468 4.1056 10.6352 8.2028 39.4904 4.8923 31.0916 5.8484 40.8631 16.7630 9.1523 4.0856 6.1118 1.7156 15.1735 16.8446 4.6513 5.7413 36.7132 1.4178 5.9631 3.1355 0.3009 16.0191 5.5043 17.2814 11.6339 10.2657 5.2261 85.7493 23.2868 96.1201 190.4031 15.4293 18.0918 4.5555 21.7360 113.4622 44.3153 11.3627 86.0907 22.7736 63.3828 37.4589 476.8316 23.7141 35.9384 2.5041 40.1041 39.9092 79.5934 30.4123 0.3127 7.5615 287.2241 65.6883 100.1395 37.8293 58.2251 14.5037 19.1600 23.4140 16.1883 15.6211 1.2017 9.8660 13.8898 10.3883
temp: 298.150 k
press: 1.00000 atm
elementType: 16 8 7 7 7 6 6 6 6 6 6 6 6 6 6 6 1 1 1 1 1 1 1 1 1 1 1 1 1
symmnumber: 1
zpe: 588126.0 jmol-1
zpe.correction: 0.224005 hartree
zpe.thermalcorrener: 0.240428 hartree
zpe.thermalcorrenthalpy: 0.241372 hartree
zpe.thermalcorrgfe: 0.177935 hartree
zpe.sumelectzpe: -1063.339337 hartree
zpe.sumelectthermal: -1063.322915 hartree
zpe.sumelectthermalent: -1063.321971 hartree
zpe.sumelectthermalfe: -1063.385408 hartree
dipole: -1.1155 6.5532 2.4307
dipole: 7.0779
quadrupole: -77.6834 -100.3750 -106.3557
quadrupole: 10.3720 7.9494 -0.4702
quadrupole: 17.1213 -5.5703 -11.5510 10.3720 7.9494 -0.4702
hfenergy: -1063.5633426 hartree
pointgroup: C01 [X(C11H13N3O1S1)]
dipole: 0.6391687 -2.6761029 0.4293577 debye
polarizability: 226.1294606|2.7606927|179.7747831|0.5043018|17.9665773|91.933072 unknown
InChI: InChI=1S/C11H13N3OS/c1-7-4-5-9-8(6-7)10(13-16-9)12-11(15)14(2)3/h4-6,12H,1-3H3
charge 0 multiplicity 1
29 atoms
S  1.115197 2.707272 0.931573
O  -2.787858 1.058419 -1.036799
N  -1.34119 -0.307084 0.242004
N  -3.606088 -0.906128 -0.050413
N  -0.490129 1.855002 0.790557
C  1.121777 0.146309 0.233299
C  2.033546 1.205142 0.506941
C  -0.26636 0.585457 0.410538
C  1.618057 -1.121293 -0.169057
C  3.006628 -1.33888 -0.278622
C  3.427203 1.011528 0.399621
C  3.89666 -0.259557 0.016381
C  -2.605973 0.033664 -0.32575
C  3.563544 -2.683719 -0.711481
C  -4.890537 -0.78328 -0.756706
C  -3.476911 -1.97902 0.945794
H  0.9227 -1.932512 -0.419902
H  4.13063 1.824057 0.606594
H  4.977425 -0.426584 -0.068024
H  -1.145213 -1.28902 0.439899
H  4.222127 -3.115222 0.065606
H  2.759299 -3.412157 -0.912061
H  4.16786 -2.589598 -1.633141
H  -4.820879 0.066655 -1.452236
H  -5.715213 -0.590153 -0.043608
H  -5.119627 -1.705956 -1.324257
H  -3.044867 -2.912661 0.524761
H  -4.478534 -2.228689 1.337161
H  -2.861775 -1.649494 1.801428
