program: Gaussian 09
title: 000184535
version: EM64L-G09RevD.01
frameworkgroup: C1[X(C13H17N3OS)]
method: RPBEPBE
basis: SDD
operation: Freq
keyword: #p
keyword: freq=noraman
keyword: PBEPBE/SDD
title: #p freq=noraman PBEPBE/SDD
converged: YES YES NO NO
title: Mulliken charges:
elementType: S O N N N C C C C C C C C C C C C C H H H H H H H H H H H H H H H H H
charge: 0.365460 -0.231846 -0.393294 -0.496253 -0.343667 -0.339210 -0.393032 -0.349286 0.396439 0.201852 -0.393751 -0.566780 0.470932 -0.684706 0.270010 -0.257715 -0.355395 -0.814027 0.242562 0.192506 0.205023 0.253023 0.185952 0.195900 0.291947 0.229168 0.219584 0.213760 0.208019 0.304730 0.245032 0.235811 0.223385 0.232571 0.235297
chargesum: 0.00000
title: Mulliken charges with hydrogens summed into heavy atoms:
elementType: S O N N N C C C C C C C C C C C C C
charge: 0.365460 -0.231846 -0.101348 -0.191523 -0.343667 0.095859 0.065013 0.032566 0.396439 0.201852 -0.393751 -0.337612 0.470932 -0.043344 0.270010 -0.012683 -0.119584 -0.122773
polarizability: 2.58596081e+02 -3.73902348e+00 1.95141575e+02 -8.53145223e+00 7.20934011e+00 1.10205212e+02
1716.lowfreq: -1.9051 -0.0019 -0.0012 0.0004 2.2047 5.4526 12.5310 22.8938 48.6247
frequency: 11.8221 22.6933 48.6229 58.8342 71.6612 76.8386 80.0476 116.7936 130.7893 166.1620 206.2713 213.6961 232.0665 248.5717 266.3261 294.0575 307.9040 331.6594 365.5175 396.0082 415.0189 423.6701 471.2924 478.3226 508.8489 519.2903 539.4461 583.2752 620.3125 650.4190 683.8702 688.9917 705.6009 737.9144 744.5821 787.3934 817.6684 832.4800 851.0634 880.8204 910.0513 916.4898 962.5316 971.9889 978.2538 1002.4514 1029.0678 1049.5118 1050.4675 1090.3231 1116.5158 1131.2522 1140.4345 1156.0027 1195.3132 1214.1094 1229.7664 1259.3779 1265.1150 1288.0361 1306.2437 1313.2167 1349.0000 1365.3805 1386.9833 1390.5355 1401.1962 1416.0111 1431.2208 1446.7353 1461.7367 1470.2011 1470.6117 1471.4769 1475.0484 1477.5051 1481.9415 1486.6167 1490.5865 1570.4884 1613.2591 1665.3004 2956.3072 2975.3431 2977.7130 2978.8320 2996.2979 3003.8583 3049.8313 3056.6586 3072.0800 3074.8931 3076.6006 3084.2065 3118.0104 3127.5201 3157.9364 3541.3121 3549.7004
redmass: 4.4540 4.5053 5.5164 3.3727 3.4767 1.1928 1.8566 3.7547 3.0270 4.3874 5.7816 3.4713 1.3931 2.5062 4.0060 2.7812 4.5849 3.4889 5.8255 3.4655 1.3221 2.8865 1.9162 2.4374 4.2505 2.4620 7.8876 6.3175 6.2148 4.7536 4.3130 8.4753 6.2882 1.2407 4.5386 2.7857 1.3467 2.4978 1.8072 1.4678 2.2725 3.0036 1.3392 1.7777 2.2019 1.5661 5.7782 1.5681 3.0280 2.9435 2.0879 2.3137 1.9191 1.4343 1.9987 2.3782 1.3477 1.5360 1.3958 1.1080 2.1106 1.3623 1.4365 1.3707 4.4880 1.2143 1.2645 3.4884 3.1329 1.1571 1.1000 1.4349 1.3016 1.4277 1.1723 1.0454 1.5856 1.0878 2.7461 6.5184 6.3181 6.8492 1.0591 1.0362 1.0373 1.0630 1.0651 1.0971 1.0996 1.0978 1.1001 1.1005 1.1007 1.0988 1.0910 1.0887 1.0962 1.0766 1.0768
irintensity: 0.5267 0.1633 6.9288 1.2104 3.5385 1.3679 0.6786 0.0831 1.4127 1.0391 4.4103 1.7614 0.3197 1.3601 3.5556 3.8598 0.3886 5.5862 6.9429 20.2564 34.9942 13.8550 70.3100 51.0504 37.2342 45.0856 13.6794 8.6450 1.9664 4.9230 6.4324 21.1354 14.3101 13.6388 5.3065 5.5179 37.1228 6.0449 3.4271 6.9394 1.3128 0.6209 0.2073 9.8401 9.9458 11.8661 7.2583 11.8875 6.3985 8.4868 2.3544 16.1599 1.8095 8.1770 375.7880 2.2114 19.2314 7.4118 63.3224 0.5272 5.2683 35.4051 5.8781 2.6676 15.1990 8.9755 11.3076 23.5123 121.2012 30.2139 8.2615 156.4103 257.4746 265.3794 90.7304 26.1600 19.5860 19.9417 129.7196 0.2742 8.3699 183.7580 34.0404 31.5437 38.8333 41.7415 52.9525 14.2696 36.4509 18.9441 68.1579 5.4212 68.8306 16.4180 15.1639 9.9273 13.8746 7.3184 21.4175
temp: 298.150 k
press: 1.00000 atm
elementType: 16 8 7 7 7 6 6 6 6 6 6 6 6 6 6 6 6 6 1 1 1 1 1 1 1 1 1 1 1 1 1 1 1 1 1
symmnumber: 1
zpe: 737390.6 jmol-1
zpe.correction: 0.280857 hartree
zpe.thermalcorrener: 0.299658 hartree
zpe.thermalcorrenthalpy: 0.300602 hartree
zpe.thermalcorrgfe: 0.230857 hartree
zpe.sumelectzpe: -1141.796855 hartree
zpe.sumelectthermal: -1141.778055 hartree
zpe.sumelectthermalent: -1141.777111 hartree
zpe.sumelectthermalfe: -1141.846856 hartree
dipole: 1.6360 -5.2322 -3.4096
dipole: 6.4558
quadrupole: -88.0904 -109.5982 -121.9701
quadrupole: 4.1720 3.0874 0.8009
quadrupole: 18.4625 -3.0453 -15.4172 4.1720 3.0874 0.8009
hfenergy: -1142.0777124 hartree
pointgroup: C01 [X(C13H17N3O1S1)]
dipole: 0.6676978 2.4139526 -0.4221473 debye
polarizability: 258.8057226|7.2527584|162.8102356|2.5711425|-41.9039777|142.3269103 unknown
InChI: InChI=1S/C13H17N3OS/c1-3-4-7-14-13(17)15-12-10-8-9(2)5-6-11(10)18-16-12/h5-6,8,14-15H,3-4,7H2,1-2H3
charge 0 multiplicity 1
35 atoms
S  1.810966 -1.886622 1.957667
O  -1.87589 -1.187443 -0.886067
N  -2.685998 1.005795 -0.754645
N  -0.479075 0.572809 -0.112459
N  0.253923 -1.174627 1.333724
C  -5.004608 0.097721 -0.291663
C  -4.001273 0.659902 -1.326848
C  -5.396625 1.102569 0.815051
C  1.962149 0.182226 0.300494
C  0.551105 -0.16063 0.50275
C  2.811166 -0.671269 1.060886
C  2.532163 1.186411 -0.524976
C  3.93092 1.353956 -0.576997
C  -6.418785 0.514705 1.8120
C  -1.70994 0.023903 -0.591002
C  4.214116 -0.524751 1.021013
C  4.755813 0.49076 0.209693
C  4.567164 2.416562 -1.455562
H  -4.567923 -0.813504 0.159157
H  -5.916777 -0.220737 -0.836962
H  -4.413684 1.567214 -1.809269
H  -3.823134 -0.096247 -2.110948
H  -5.816919 2.019403 0.350483
H  -4.4882 1.413497 1.370643
H  -2.596077 1.886235 -0.24533
H  1.888014 1.822162 -1.145634
H  -6.009876 -0.384699 2.308549
H  -6.685579 1.24489 2.597911
H  -7.350315 0.217622 1.294376
H  -0.284989 1.554336 -0.318158
H  4.870138 -1.180558 1.601954
H  5.844469 0.618948 0.170783
H  3.808287 2.994079 -2.010751
H  5.1615 3.131174 -0.855681
H  5.253172 1.965706 -2.19688
