program: Gaussian 09
title: 000184532
version: EM64L-G09RevD.01
frameworkgroup: C1[X(C11H13N3OS)]
method: RPBEPBE
basis: SDD
operation: Freq
keyword: #p
keyword: freq=noraman
keyword: PBEPBE/SDD
title: #p freq=noraman PBEPBE/SDD
converged: YES YES NO NO
title: Mulliken charges:
elementType: S O N N N C C C C C C C C C C C H H H H H H H H H H H H H
charge: 0.378726 -0.301930 -0.436449 -0.457685 -0.408572 0.391377 -0.417690 0.191339 -0.512570 0.458917 -0.267836 -0.356597 -0.818371 -0.334320 0.300328 -0.648800 0.328130 0.241330 0.235103 0.315631 0.227709 0.238371 0.227061 0.216717 0.260629 0.290273 0.236901 0.202570 0.219709
chargesum: 0.00000
title: Mulliken charges with hydrogens summed into heavy atoms:
elementType: S O N N N C C C C C C C C C C C
charge: 0.378726 -0.301930 -0.120818 -0.457685 -0.118298 0.391377 -0.417690 0.191339 -0.184440 0.458917 -0.026506 -0.121494 -0.125229 0.143026 0.300328 0.010379
polarizability: 2.26099928e+02 -1.50325661e+00 1.93925319e+02 -2.46403281e+00 -2.77011808e+00 7.98719513e+01
1716.lowfreq: -9.6206 -0.0014 -0.0004 -0.0003 4.5930 5.3387 9.6858 24.8475 48.4140
frequency: -3.1872 24.6860 48.4036 71.4265 88.8925 107.2249 119.6339 166.6463 182.7583 229.2343 239.5452 266.1588 301.7189 319.5605 336.8661 365.8938 392.7329 430.3021 458.0232 471.6301 512.7502 526.0677 612.3617 626.5564 636.2962 677.0083 697.6742 708.4862 718.5797 739.1153 749.5438 813.0200 815.0119 880.4718 901.9788 935.1173 968.3660 986.4988 1008.1102 1028.5927 1054.8628 1076.1896 1095.2272 1139.9905 1146.0466 1156.1462 1211.7184 1229.9547 1279.0517 1287.4749 1342.3201 1360.5898 1372.0823 1387.6788 1389.0083 1399.5243 1441.6664 1454.3492 1463.5253 1470.6569 1473.6020 1477.4832 1480.1549 1496.8745 1518.3095 1567.3063 1610.3060 1652.1707 2976.5815 2981.4123 2997.2270 3053.0086 3067.4161 3086.3611 3091.2360 3098.2480 3124.5124 3155.7298 3167.6264 3486.6182 3547.2005
redmass: 3.0287 4.1521 5.0492 1.0502 3.6783 3.4310 4.0233 3.5734 3.1058 1.4861 5.6312 4.6094 4.3957 4.3373 3.3253 4.1241 2.0214 3.1823 2.2683 3.8040 3.6981 7.6085 6.9107 4.2456 2.4190 2.4716 5.9910 7.1629 4.5833 2.6495 5.2805 1.6819 1.3349 4.2557 2.2303 1.3031 1.3648 2.5334 1.8387 5.2265 1.5595 2.9961 2.3346 1.6975 2.5807 1.3905 2.2434 2.5709 1.4392 1.1484 3.3185 1.4770 2.8701 1.2299 5.4218 1.2366 4.7754 2.4582 1.1170 1.0581 1.0580 1.1761 1.0715 1.6675 2.4246 5.6756 6.0073 4.8085 1.0378 1.0359 1.0665 1.0975 1.0981 1.0969 1.0983 1.1017 1.0885 1.0961 1.0935 1.0746 1.0772
irintensity: 3.1790 2.4134 8.3128 0.1860 1.1159 5.6075 0.2839 0.5110 0.9087 3.3675 3.5865 0.2336 0.2144 1.2961 27.2413 2.1317 21.7902 5.9061 44.5759 15.0133 2.6972 7.5204 1.5151 20.5411 55.6298 32.6031 46.1471 11.4536 25.2645 3.8188 16.6265 11.3453 37.6679 1.0959 7.6446 5.6896 2.9386 0.8851 10.4895 19.7565 13.5483 6.1210 4.2433 1.9975 4.6165 12.8909 290.1481 35.5154 7.3857 67.9394 78.6493 10.2107 62.6821 18.0575 21.4354 12.3798 247.3698 24.6819 68.1388 30.8688 12.3989 2.3434 14.3636 268.5921 488.1998 39.5331 2.4688 176.2022 39.1559 30.9328 58.3811 22.2099 16.0040 33.5409 15.2502 32.9115 12.3619 11.3662 49.1869 17.1983 25.0464
temp: 298.150 k
press: 1.00000 atm
elementType: 16 8 7 7 7 6 6 6 6 6 6 6 6 6 6 6 1 1 1 1 1 1 1 1 1 1 1 1 1
symmnumber: 1
zpe: 592333.3 jmol-1
zpe.correction: 0.225608 hartree
zpe.thermalcorrener: 0.240721 hartree
zpe.thermalcorrenthalpy: 0.241665 hartree
zpe.thermalcorrgfe: 0.182009 hartree
zpe.sumelectzpe: -1063.359069 hartree
zpe.sumelectthermal: -1063.343955 hartree
zpe.sumelectthermalent: -1063.343011 hartree
zpe.sumelectthermalfe: -1063.402668 hartree
dipole: 2.2811 0.5796 1.0732
dipole: 2.5867
quadrupole: -73.9918 -101.2679 -106.2838
quadrupole: -12.1123 1.4885 0.3663
quadrupole: 19.8560 -7.4201 -12.4360 -12.1123 1.4885 0.3663
hfenergy: -1063.5846764 hartree
pointgroup: C01 [X(C11H13N3O1S1)]
dipole: -0.7761017 -0.6516577 -0.0930967 debye
polarizability: 224.1571938|12.257414|113.7837847|-0.3199988|52.0386275|161.95622 unknown
InChI: InChI=1S/C11H13N3OS/c1-3-12-11(15)13-10-8-6-7(2)4-5-9(8)16-14-10/h4-6,12-13H,3H2,1-2H3
charge 0 multiplicity 1
29 atoms
S  1.916861 1.678666 2.979584
O  -1.494737 -0.433799 -0.916541
N  -1.358304 0.340663 1.326903
N  0.161947 1.388555 2.681068
N  -3.407152 -0.285705 0.412801
C  1.210751 0.253434 0.825814
C  2.37345 0.750926 1.495124
C  0.000775 0.652737 1.558752
C  1.384031 -0.51539 -0.359655
C  2.676181 -0.782616 -0.854402
C  3.674053 0.498727 1.011993
C  3.812397 -0.268821 -0.15879
C  2.868241 -1.602677 -2.118644
C  -4.3064 -0.794437 -0.636329
C  -2.037752 -0.148088 0.191131
C  -4.777368 -2.241269 -0.37686
H  0.495299 -0.864178 -0.890592
H  4.554941 0.88768 1.532329
H  4.816806 -0.474549 -0.549073
H  -1.931636 0.67837 2.107656
H  3.41543 -2.541711 -1.909425
H  1.900225 -1.87109 -2.573437
H  3.454443 -1.046407 -2.874069
H  -5.176613 -0.115812 -0.724802
H  -3.739088 -0.742132 -1.580492
H  -3.796568 -0.139269 1.345468
H  -3.913898 -2.927483 -0.334485
H  -5.334899 -2.323793 0.574963
H  -5.446814 -2.575631 -1.190589
