program: Gaussian 09
title: 000184527
version: EM64L-G09RevD.01
frameworkgroup: C1[X(C13H10ClNO5)]
method: RPBEPBE
basis: SDD
operation: Freq
keyword: #p
keyword: freq=noraman
keyword: PBEPBE/SDD
title: #p freq=noraman PBEPBE/SDD
converged: YES YES NO NO
title: Mulliken charges:
elementType: Cl O O O O O N C C C C C C C C C C C C C H H H H H H H H H H
charge: -0.014974 -0.137100 -0.176190 -0.135483 -0.182800 -0.186123 0.015042 -0.388680 -0.408575 -0.524274 -0.506957 0.221036 0.178275 0.117963 0.251918 0.205229 -0.301985 -0.327235 -0.227358 -0.097060 0.288618 0.239221 0.239190 0.266505 0.224677 0.225387 0.265153 0.292861 0.311560 0.272158
chargesum: 0.00000
title: Mulliken charges with hydrogens summed into heavy atoms:
elementType: Cl O O O O O N C C C C C C C C C C C C C
charge: -0.014974 -0.137100 -0.176190 -0.135483 -0.182800 -0.186123 0.015042 -0.100061 0.069836 -0.033092 -0.016417 0.221036 0.178275 0.117963 0.251918 0.205229 -0.009125 -0.015675 0.044800 -0.097060
polarizability: 2.39529326e+02 -1.56577600e+01 1.70253542e+02 -1.45172937e+01 -1.21294783e+01 1.19796412e+02
1716.lowfreq: -3.8394 -2.6908 0.0020 0.0020 0.0024 4.9455 20.7264 32.0151 35.1208
frequency: 20.5541 32.0107 35.0362 59.5322 74.2914 91.9246 116.6989 142.0329 153.7894 162.6902 178.4953 195.5131 223.4966 258.8185 312.5390 324.1162 367.8829 371.5043 391.2219 417.6056 427.1748 443.3724 464.0430 525.8432 536.7378 564.3781 589.7532 622.5471 649.7102 665.0742 676.4972 703.2150 737.1884 765.3459 817.3023 828.7465 839.5858 844.1296 891.8337 896.7666 914.6837 917.6978 971.9671 1009.3310 1014.6142 1037.4666 1063.4606 1065.3654 1090.1927 1093.0086 1145.9735 1156.7302 1163.4446 1197.6083 1205.5296 1211.3338 1248.6372 1258.1773 1284.5566 1304.8299 1307.0252 1338.9646 1348.1866 1369.5876 1404.3312 1440.1764 1448.7226 1460.0986 1474.2830 1559.8313 1588.6530 1603.1964 1619.0717 1672.6802 2972.2184 2977.4940 2982.0491 3006.0494 3068.2739 3081.9391 3087.6041 3168.3570 3184.7274 3188.2464
redmass: 8.9307 7.3269 5.4974 8.4850 9.6270 4.0128 9.7479 7.5632 7.9410 13.9905 11.7635 5.5477 3.0145 8.1389 8.2506 7.3874 9.4139 3.3895 6.6883 5.1209 5.6007 2.1207 6.5828 5.1428 4.3195 4.3767 5.7587 4.3149 6.3985 5.9775 7.2460 7.7286 5.7396 3.4530 3.0317 3.2870 1.6233 1.8867 2.7507 3.8683 1.4972 3.4501 1.3919 2.4825 1.9091 2.2340 1.6625 1.9353 3.3829 2.3704 1.8759 1.7685 1.3909 2.8701 7.7671 1.4821 1.3489 1.4827 2.4607 1.5773 1.2612 1.4035 3.9001 11.4148 6.1120 1.0881 1.0864 2.6145 1.0811 8.7587 8.0252 9.0643 10.0584 11.2103 1.0681 1.0679 1.0761 1.0609 1.1016 1.0957 1.0975 1.0895 1.0967 1.0936
irintensity: 3.1103 1.3542 3.9989 1.2349 2.1916 0.3587 0.3086 0.2835 1.1813 2.1717 3.1770 1.1783 3.1625 2.4731 3.1997 0.2738 2.8567 3.3526 1.6947 14.9712 6.4011 0.0836 10.9806 5.0370 19.8797 16.4070 29.0791 1.9717 7.4570 1.8905 12.8479 18.9322 6.3531 33.1168 2.9918 25.0509 3.7473 29.4328 8.1169 11.9718 17.2619 13.8299 0.8052 33.0645 75.0483 8.1426 16.5838 0.2163 33.4149 47.4457 51.1228 42.8233 14.0583 13.5650 198.0182 46.6272 4.6319 28.5316 279.8440 26.5068 4.6178 3.0192 21.0984 150.6069 11.3941 12.7340 17.8066 44.2910 13.2096 7.2082 92.8557 18.2573 200.8947 142.7084 7.9523 5.2763 8.4727 31.5552 21.9842 12.6982 16.3074 0.3011 2.0496 7.6357
temp: 298.150 k
press: 1.00000 atm
elementType: 17 8 8 8 8 8 7 6 6 6 6 6 6 6 6 6 6 6 6 6 1 1 1 1 1 1 1 1 1 1
symmnumber: 1
zpe: 545050.8 jmol-1
zpe.correction: 0.207599 hartree
zpe.thermalcorrener: 0.225661 hartree
zpe.thermalcorrenthalpy: 0.226605 hartree
zpe.thermalcorrgfe: 0.158964 hartree
zpe.sumelectzpe: -1390.772255 hartree
zpe.sumelectthermal: -1390.754193 hartree
zpe.sumelectthermalent: -1390.753249 hartree
zpe.sumelectthermalfe: -1390.820890 hartree
dipole: -1.0094 -2.7289 -4.8868
dipole: 5.6874
quadrupole: -104.8038 -134.1162 -127.3682
quadrupole: 0.1509 17.4860 -1.8764
quadrupole: 17.2923 -12.0201 -5.2721 0.1509 17.4860 -1.8764
hfenergy: -1390.9798536 hartree
pointgroup: C01 [X(C13H10Cl1N1O5)]
dipole: 0.6221312 -1.3755134 1.6515906 debye
polarizability: 231.494075|29.9362229|171.0901734|-13.2753438|19.7978941|126.9950314 unknown
InChI: InChI=1S/C13H10ClNO5/c14-7-4-5-8(9(6-7)15(19)20)13(18)12-10(16)2-1-3-11(12)17/h4-6,12H,1-3H2
charge 0 multiplicity 1
30 atoms
Cl -5.234736 -1.842747 0.395414
O  2.572675 1.979818 -1.036898
O  1.811005 -2.391657 -0.333003
O  0.80302 -0.039851 -2.197991
O  -0.238558 2.15548 0.376098
O  -2.167785 2.304015 1.580052
N  -1.381832 1.688931 0.766127
C  1.582224 0.019238 0.102069
C  4.459595 -0.318322 0.909657
C  3.809377 1.089193 0.875587
C  3.422268 -1.424511 1.23721
C  2.655471 1.134427 -0.125071
C  2.241435 -1.38105 0.27555
C  0.503155 -0.050588 -0.981027
C  -0.924092 -0.393847 -0.57978
C  -1.800941 0.366932 0.236199
C  -1.426024 -1.612701 -1.106088
C  -3.11452 -0.052637 0.543881
C  -2.729647 -2.062026 -0.814195
C  -3.555883 -1.274636 0.016126
H  1.137941 0.256483 1.091363
H  4.933593 -0.530954 -0.067031
H  5.259924 -0.335167 1.670351
H  4.541197 1.864638 0.595653
H  3.417647 1.336374 1.884191
H  3.040299 -1.267193 2.267879
H  3.871137 -2.430864 1.192939
H  -0.767783 -2.211367 -1.74158
H  -3.752251 0.581923 1.163957
H  -3.09661 -3.006934 -1.224341
