program: Gaussian 09
title: 000184526
version: EM64L-G09RevD.01
frameworkgroup: C1[X(C9H12O4)]
method: RPBEPBE
basis: SDD
operation: Freq
keyword: #pfreq=noraman
keyword: PBEPBE/SDD
title: #p freq=noraman PBEPBE/SDD
converged: NO YES NO NO
title: Mulliken charges:
elementType: O O O O C C C C C C C C C H H H H H H H H H H H H
charge: -0.223489 -0.412992 -0.492844 -0.213007 -0.168871 -0.690941 -0.697859 0.181728 -0.301808 -0.130294 -0.264471 0.131265 0.128236 0.210955 0.230037 0.225311 0.222222 0.204711 0.223175 0.235417 0.228390 0.298686 0.268448 0.403344 0.404647
chargesum: 0.00000
title: Mulliken charges with hydrogens summed into heavy atoms:
elementType: O O O O C C C C C C C C C
charge: -0.223489 -0.009648 -0.088197 -0.213007 0.042084 -0.013370 -0.034556 0.181728 -0.073417 0.168392 0.003977 0.131265 0.128236
polarizability: 2.60409331e+02 -3.50969206e+00 1.06510647e+02 3.64612443e+00 -5.43428414e+00 6.47626064e+01
1716.lowfreq: -16.7937 -0.0011 -0.0008 -0.0006 1.6002 3.6543 30.4634 34.8896 57.6158
frequency: 30.2271 34.6847 57.6074 66.3246 101.4936 151.0640 168.6768 184.0972 194.9414 229.2222 267.1978 279.4545 292.9868 315.1087 358.7739 404.2092 468.3221 468.3586 526.5509 528.3827 580.4949 611.3944 629.4766 701.6222 723.3232 797.4529 842.7399 863.8099 908.6233 914.2696 923.2674 960.6552 984.5928 1020.9961 1053.8888 1082.0236 1100.2646 1124.1650 1176.8820 1205.5340 1215.7484 1270.0880 1273.5274 1285.2556 1309.5775 1341.3009 1375.2238 1379.4474 1397.5720 1462.4921 1466.2455 1478.3036 1486.0894 1548.2864 1615.7426 1639.7996 1665.5296 2965.8306 2979.3428 2990.9362 3076.7837 3083.1850 3086.2013 3097.3603 3107.5692 3128.2582 3148.6125 3509.2259 3568.2620
redmass: 3.1789 5.0851 5.4808 7.7023 6.5218 4.8449 2.7531 1.1557 4.6380 1.1618 2.4462 3.8977 3.1690 5.5279 2.8190 5.0922 3.2667 2.9341 1.1780 6.8030 1.3677 3.9771 3.4619 3.2697 6.3126 4.9717 4.1585 1.4389 2.7258 1.5838 1.2692 1.3798 3.8882 1.1310 2.9547 1.5589 1.7564 2.2395 1.7580 1.9083 1.4137 1.3849 1.5525 1.6005 1.8131 2.1450 1.6709 1.4600 1.2129 1.0455 1.0506 1.0472 1.0657 7.5358 5.8418 6.5873 8.5971 1.0821 1.0343 1.0364 1.1001 1.1009 1.1000 1.0993 1.0924 1.0911 1.0892 1.0649 1.0652
irintensity: 0.1027 3.5009 1.4863 0.1427 3.7851 0.0656 0.2238 0.0346 0.1064 0.7153 5.6435 4.4804 0.6615 5.8966 1.8576 39.8904 4.6753 2.0842 236.1240 13.7364 70.6756 41.0586 1.2299 2.8465 36.6981 38.4171 22.0576 0.0463 4.5815 20.0825 17.8031 11.2450 306.6246 56.6919 522.1240 8.0750 130.5634 9.6029 1.5295 100.3836 180.0109 32.9292 137.1993 23.3305 56.1438 12.3256 164.5449 85.1747 38.4580 7.6548 2.2355 13.8799 28.4562 146.7273 73.0694 144.3314 205.1381 30.3760 28.2513 34.1625 45.8809 14.2946 50.3483 31.2939 15.3365 0.0435 1.2165 227.8581 112.2018
temp: 298.150 k
press: 1.00000 atm
elementType: 8 8 8 8 6 6 6 6 6 6 6 6 6 1 1 1 1 1 1 1 1 1 1 1 1
symmnumber: 1
zpe: 510117.3 jmol-1
zpe.correction: 0.194293 hartree
zpe.thermalcorrener: 0.208881 hartree
zpe.thermalcorrenthalpy: 0.209825 hartree
zpe.thermalcorrgfe: 0.151248 hartree
zpe.sumelectzpe: -650.039309 hartree
zpe.sumelectthermal: -650.024722 hartree
zpe.sumelectthermalent: -650.023777 hartree
zpe.sumelectthermalfe: -650.082355 hartree
dipole: 2.6846 1.8316 -0.1390
dipole: 3.2528
quadrupole: -53.9836 -84.6459 -77.9299
quadrupole: -15.3055 2.7755 0.7309
quadrupole: 18.2029 -12.4594 -5.7434 -15.3055 2.7755 0.7309
hfenergy: -650.2336028 hartree
pointgroup: C01 [X(C9H12O4)]
dipole: 1.0588141 0.7166681 0.0556566 debye
dipolederiv: -0.8645135 0.0202025 -0.0125233 -0.5437028 -0.7685895 -0.0394067 0.0197554 0.0368909 -0.2885297 -0.3074119 0.103987 -0.003477 1.1049454 -1.048288 0.0903822 -0.082509 0.0563227 -0.3968173 -1.4619117 0.5006599 -0.0771065 0.6591484 -0.6438936 0.041246 -0.0951013 0.0363052 -0.4744491 -0.8910427 -0.1720727 -0.0088008 -0.6798602 -0.9470946 0.0252297 0.0263994 0.0412346 -0.3096568 -0.1916872 0.1701772 0.024573 0.3425344 -0.0849146 -0.0646814 0.17907 -0.109918 0.1142719 -0.0726989 0.0281212 -0.008829 0.0062148 0.0545718 -0.0520076 -0.1633212 0.021031 0.0162758 -0.043391 -0.0604342 -0.0211436 -0.0068089 0.0189742 -0.0218133 -0.0273439 -0.0262951 0.0244971 2.1318772 -0.148636 0.0040602 0.483639 0.72429 0.0306419 -0.0014185 -0.0486013 0.06938 -1.3558252 0.0066993 -0.0334891 -0.0954523 0.0845521 -0.0179556 -0.0911027 -0.0073171 -0.1944721 0.4136935 -0.1157282 0.0180476 0.0623809 0.0279006 -0.0004689 0.0363202 -0.0119331 -0.0321601 -0.100066 0.2279934 -0.0093669 -0.0480998 -0.0595259 -0.0123155 0.0137566 0.0011543 -0.166824 -0.9163243 -0.2867983 -0.0144931 -1.3427135 0.8968688 -0.1131101 0.0559114 -0.079027 0.0574004 2.7056806 -0.204038 0.1105761 0.4809099 1.2032911 -0.0566596 0.0710236 -0.0800491 0.2824649 -0.0159852 -0.0561641 0.0495545 -0.0885497 -0.0480958 0.1026262 0.0413889 0.0935307 -0.0450515 0.0831872 -0.0118449 0.045945 -0.0590965 -0.0289323 0.1287004 0.0551252 0.0555501 -0.0287764 -0.0513148 -0.1309725 -0.0822847 -0.1558063 0.0247942 -0.0660997 -0.1086044 -0.0322626 0.0372292 -0.1357902 0.1507042 0.0140182 0.1560986 -0.0050963 -0.009421 0.0411032 -0.0101148 0.0613728 -0.1617796 0.0962286 -0.024634 0.159459 -0.0026733 0.0068491 -0.0067276 -0.0095344 0.097095 0.0919169 0.0039675 0.0431933 -0.0255858 0.0497971 -0.1004803 0.00197 -0.0914294 -0.1254637 0.1250562 -0.0125071 0.0007893 -0.0787543 -0.0122848 0.0848828 0.0380731 0.1122269 -0.0038534 0.0722526 -0.0045783 -0.0080905 -0.0049861 -0.1016676 0.0180162 -0.019282 0.020763 0.1532022 0.0782909 -0.0075987 -0.0055255 -0.0188791 0.0219827 0.0102114 -0.0044963 0.0097276 0.1607127 0.0619287 0.001813 -0.0045157 -0.0439195 -0.0072357 0.01211 0.0002783 0.0130975 0.1640027 0.4090868 -0.0098341 -0.0008289 -0.1082226 0.4388458 -0.0063311 0.0090655 -0.0036819 0.4011273 0.3967716 -0.0893466 0.0043515 -0.1548928 0.2124236 0.0098548 0.0106662 0.0123294 0.4270221 unknown
polarizability: 260.1687713|-4.6779033|107.2480443|7.0041467|-0.2415007|64.265769 unknown
InChI: InChI=1S/C9H12O4/c1-6(2)7(10)4-3-5-8(11)9(12)13/h3-6,11-12H,1-2H3
charge 0 multiplicity 1
25 atoms
O  -2.540466 -1.585738 -0.099341
O  2.568582 -1.640182 0.156965
O  4.860343 -0.429067 0.166246
O  3.965432 1.72645 -0.03924
C  -3.749003 0.543945 -0.302989
C  -4.007735 1.221217 1.077238
C  -4.967213 -0.278408 -0.763553
C  -2.481036 -0.320584 -0.19552
C  -1.181664 0.404287 -0.17964
C  0.02159 -0.257155 -0.068129
C  1.300532 0.405971 -0.061697
C  2.506512 -0.255999 0.046101
C  3.790157 0.492596 0.047072
H  -3.544469 1.351783 -1.03731
H  -4.231885 0.455408 1.841684
H  -3.137957 1.80814 1.424502
H  -4.874562 1.902588 1.006341
H  -5.872829 0.354157 -0.794604
H  -4.805107 -0.70809 -1.767865
H  -5.144392 -1.120056 -0.0722
H  -1.207179 1.499022 -0.273955
H  -0.000475 -1.351702 0.017631
H  1.351125 1.497654 -0.144881
H  3.52007 -1.923046 0.221257
H  5.732028 0.044609 0.169486
