program: Gaussian 09
title: 000184525
version: EM64L-G09RevD.01
frameworkgroup: C1[X(C7H9ClN4O5)]
method: RPBEPBE
basis: SDD
operation: Freq
keyword: #p
keyword: freq=noraman
keyword: PBEPBE/SDD
title: #p freq=noraman PBEPBE/SDD
converged: YES YES NO NO
title: Mulliken charges:
elementType: Cl O O O O O N N N N C C C C C C C H H H H H H H H H
charge: -0.066452 -0.424639 -0.167094 -0.234142 -0.164341 -0.146730 -0.187960 -0.036278 0.046653 0.058923 -0.384514 -0.059891 0.274612 0.254879 0.091414 -0.619248 -0.759063 0.262512 0.245070 0.285828 0.292845 0.302888 0.279534 0.271922 0.236545 0.346729
chargesum: 0.00000
title: Mulliken charges with hydrogens summed into heavy atoms:
elementType: Cl O O O O O N N N N C C C C C C C
charge: -0.066452 -0.077910 -0.167094 -0.234142 -0.164341 -0.146730 -0.187960 -0.036278 0.046653 0.058923 0.123067 0.225936 0.274612 0.254879 0.091414 -0.023515 0.028937
polarizability: 1.83647969e+02 3.21696901e+00 1.51009645e+02 -6.46355804e+00 -7.25866753e+00 8.59790100e+01
1716.lowfreq: -1.5354 -0.0028 -0.0024 -0.0020 3.6867 7.2179 22.7661 30.3442 36.6263
frequency: 22.3963 30.2732 36.6051 77.3695 84.3061 89.3384 127.3116 140.0035 148.9076 154.1432 176.3905 218.0517 248.7733 269.7197 299.5587 339.0268 366.8319 386.9746 413.7785 438.0825 448.2320 472.5779 532.3341 567.0055 625.5600 637.1241 676.9047 686.9766 698.9542 724.0250 737.0258 765.7619 826.2784 852.5125 881.4976 946.6651 996.0914 1020.3750 1023.4662 1053.2330 1090.0321 1139.4709 1168.5360 1199.7988 1219.1082 1242.2559 1259.0825 1287.1676 1299.0188 1307.4016 1338.9089 1347.3451 1353.5301 1373.6125 1391.3614 1397.4620 1399.7431 1442.2171 1446.0228 1464.7988 1473.7825 1490.5988 1500.1216 2992.5915 3050.2737 3057.7102 3073.8612 3076.1313 3120.9450 3131.6876 3161.8765 3489.6281
redmass: 9.8509 10.9317 10.3612 7.7127 10.0051 6.7718 3.8506 9.9436 6.9759 1.2498 5.0363 5.5085 5.6735 4.1139 5.1283 7.8756 2.6652 8.9776 3.8548 6.7958 1.0714 3.4732 4.5768 7.4781 5.0751 8.2638 5.6803 6.7281 8.0721 11.9923 12.1251 9.2059 3.3023 4.5189 1.9873 2.2792 2.2832 1.8822 3.1284 1.5060 2.0031 4.0229 1.6413 3.4043 2.1140 1.6540 10.8820 1.5261 11.0220 1.4021 2.4913 1.7573 1.9903 1.8966 10.4173 1.2962 2.2104 1.1107 1.1721 1.0726 1.3702 4.9231 4.3327 1.0393 1.0735 1.0686 1.0591 1.0969 1.1049 1.0979 1.1121 1.0654
irintensity: 1.0787 2.5340 1.0724 1.4767 0.7956 4.0723 0.0836 0.1643 1.2972 1.4895 4.3246 1.3281 5.2843 6.0104 1.6770 6.1294 0.7455 2.5669 8.9793 6.1574 145.9064 7.7709 29.7714 2.3421 9.5351 6.5358 8.9753 8.8522 3.0591 24.6721 2.1140 10.2474 14.9553 29.0554 0.9183 13.2517 3.4210 36.5013 8.3861 5.8815 44.5924 74.4716 60.1001 45.2986 102.9761 30.8603 122.5300 1.8853 20.2642 18.2871 184.7921 58.4031 57.2943 7.6343 155.5364 9.1755 79.3503 13.4999 30.0596 34.6698 12.0212 14.3202 147.5000 6.2558 3.0340 5.3218 7.1235 3.9763 2.1944 1.5749 3.2203 22.7138
temp: 298.150 k
press: 1.00000 atm
elementType: 17 8 8 8 8 8 7 7 7 7 6 6 6 6 6 6 6 1 1 1 1 1 1 1 1 1
symmnumber: 1
zpe: 466702.3 jmol-1
zpe.correction: 0.177758 hartree
zpe.thermalcorrener: 0.194707 hartree
zpe.thermalcorrenthalpy: 0.195651 hartree
zpe.thermalcorrgfe: 0.130491 hartree
zpe.sumelectzpe: -1325.846709 hartree
zpe.sumelectthermal: -1325.829760 hartree
zpe.sumelectthermalent: -1325.828816 hartree
zpe.sumelectthermalfe: -1325.893976 hartree
dipole: 7.6139 2.3760 -1.2197
dipole: 8.0687
quadrupole: -130.4789 -108.0243 -106.6739
quadrupole: -1.2279 2.2383 -3.1151
quadrupole: -15.4199 7.0348 8.3851 -1.2279 2.2383 -3.1151
hfenergy: -1326.0244667 hartree
pointgroup: C01 [X(C7H9Cl1N4O5)]
dipole: -3.0219189 0.8697995 0.4344618 debye
dipolederiv: -0.5014593 -0.0011467 0.1127862 0.105966 -0.2383664 -0.0618714 0.1869514 -0.0187776 -0.2626711 -0.4893079 -0.0540915 -0.2416461 -0.0344097 -0.580348 0.1318885 -0.3632634 0.0917312 -0.535309 -0.5886324 0.3326851 -0.1322468 0.1795294 -0.6240693 0.0541791 -0.1355671 0.0446178 -0.1927471 -0.8724628 -0.2721692 -0.0829984 -0.2193915 -0.6570263 -0.0055497 -0.1205901 -0.0138448 -0.2468051 -0.5350876 0.0360392 0.097123 0.0714028 -0.28141 -0.2631645 -0.0047104 -0.1974763 -0.5324684 -0.6868682 -0.1760468 -0.1837935 -0.0900933 -0.3004402 -0.1769695 -0.0567059 -0.1738229 -0.45379 -0.6938912 -0.2553494 0.0461102 -0.0515076 -0.1253929 -0.0078348 0.0076012 -0.0541039 -0.0955754 -0.6438032 0.5047129 0.0322541 0.088243 -0.6049531 0.0018293 -0.0346318 -0.1117302 -0.1912407 1.2024505 -0.0657079 0.2552006 0.1989275 1.7961859 -0.1013317 0.2181867 -0.0425957 0.236655 1.3488477 0.1250884 0.0493672 -0.0427774 0.3911582 0.5172362 0.063694 0.3823898 0.8688808 0.4628318 0.0697199 -0.02785 -0.0077355 0.1114612 -0.0386606 -0.1522895 0.0340882 0.0515611 0.2258997 -0.0267261 0.2319666 0.0064403 0.3746225 -0.1823783 0.4353504 -0.1230863 0.3563659 0.6083406 -0.5430901 -0.0464224 0.0669115 0.4503394 0.0397383 -0.0366717 0.0680014 0.0676403 0.3678191 -0.1601829 -0.0476706 -0.2114188 -1.0536936 0.0530994 0.0974407 0.0589656 0.0505156 -0.0692819 0.1633867 -0.0325444 -0.0795517 0.7229147 -0.1109697 -0.0039417 0.0221256 0.0345972 0.5187158 -0.1569834 -0.2102211 -0.1882845 0.1457642 0.1545435 -0.3684639 0.1217173 0.2539283 -0.1109977 0.2177926 -0.0066926 0.044049 -0.1420306 -0.0174735 0.0045424 0.0137503 0.0269984 0.0435892 0.0190809 -0.0372535 -0.0404878 0.0162302 0.0828865 -0.0355893 0.0387389 0.0410292 0.0074678 0.0339955 0.0112684 0.0736625 0.015955 -0.0778745 -0.0070675 -0.0373446 0.0682726 0.0146284 0.0650724 0.0620391 -0.0606833 0.0287788 0.0087295 0.0895982 -0.0115094 0.0512066 0.0632509 0.0771559 0.0366052 0.062467 -0.0098048 0.0427257 0.0495973 0.0526793 0.034547 -0.0556798 0.0108931 -0.0065439 0.0224839 0.0826442 -0.0463987 -0.0174312 -0.0690013 -0.0338913 0.0516124 -0.1178995 0.0038276 -0.0415376 0.0282855 0.0018699 0.0058666 0.006678 0.1367892 0.0319389 0.0501693 -0.0624427 0.0402039 0.0889228 -0.0239085 -0.0693888 -0.0000405 0.034084 0.0437753 0.0342239 0.0907727 0.021357 0.0639965 0.0464964 0.092981 -0.0095218 -0.0327846 0.2563039 0.0893778 0.0890052 0.0862348 0.3002763 -0.020837 0.1545025 -0.0726279 0.2642115 unknown
polarizability: 184.0069266|-2.6843175|150.4350301|-4.3584819|8.9815718|86.1946678 unknown
InChI: InChI=1S/C7H9ClN4O5/c1-4-9-6(11(14)15)7(12(16)17)10(4)3-5(13)2-8/h5,13H,2-3H2,1H3
charge 0 multiplicity 1
26 atoms
Cl -5.003068 -0.265003 0.390967
O  -2.714953 0.861797 -1.516355
O  1.905267 -2.447722 0.498861
O  -0.357454 -2.473748 0.121077
O  3.550044 -0.592577 -1.121057
O  4.131637 0.720447 0.664024
N  -0.357862 0.391627 0.39739
N  1.431267 1.777412 0.162777
N  0.779406 -1.854424 0.296786
N  3.277262 0.172331 -0.122541
C  -1.756735 -0.051029 0.588971
C  -2.443136 -0.368163 -0.766897
C  0.08049 1.71341 0.334628
C  0.784981 -0.42166 0.250192
C  1.861164 0.474933 0.120066
C  -3.694802 -1.229357 -0.601479
C  -0.80746 2.909739 0.430824
H  -1.756786 -0.94494 1.230433
H  -2.300441 0.756516 1.105161
H  -1.738732 -0.942517 -1.393721
H  -3.504575 -2.154598 -0.039284
H  -4.171998 -1.43591 -1.569522
H  -0.17782 3.809006 0.364126
H  -1.539926 2.917343 -0.395186
H  -1.361942 2.943614 1.387062
H  -3.570626 1.241876 -1.177603
