program: Gaussian 09
title: 000184513
version: EM64L-G09RevD.01
frameworkgroup: C1[X(C16H11NO4)]
method: RPBEPBE
basis: SDD
operation: Freq
keyword: #p
keyword: freq=noraman
keyword: PBEPBE/SDD
title: #p freq=noraman PBEPBE/SDD
converged: NO YES NO NO
title: Mulliken charges:
elementType: O O O O N C C C C C C C C C C C C C C C C H H H H H H H H H H H
charge: -0.427717 -0.427906 -0.186758 -0.220969 0.010848 -0.350406 -0.376601 0.056383 0.252793 0.044253 0.359410 0.481563 0.452064 0.240704 -0.409939 -0.487700 -0.467650 -0.457683 -0.449335 -0.424197 -0.243909 0.277154 0.279919 0.251330 0.249123 0.244981 0.254337 0.246693 0.281446 0.235660 0.368677 0.343434
chargesum: 0.00000
title: Mulliken charges with hydrogens summed into heavy atoms:
elementType: O O O O N C C C C C C C C C C C C C C C C
charge: -0.059040 -0.084473 -0.186758 -0.220969 0.010848 -0.073252 -0.096682 0.056383 0.252793 0.044253 0.359410 0.481563 0.452064 0.240704 -0.158609 -0.238577 -0.222670 -0.203346 -0.202643 -0.142751 -0.008249
polarizability: 3.17831002e+02 -8.04944164e+00 2.24614995e+02 -1.20979761e+01 8.43156688e+00 9.63237980e+01
1716.lowfreq: -4.4214 0.0004 0.0005 0.0011 6.2823 8.9073 52.1397 64.5523 93.8513
frequency: 52.1234 64.5490 93.8508 106.6031 126.7227 171.9017 194.7989 215.8874 223.1556 235.3984 263.8146 297.2022 321.4702 331.7899 349.8145 410.8034 434.7199 450.1085 477.6006 498.5331 507.1031 514.4448 530.3041 553.0860 573.9224 588.3167 606.0422 620.9357 683.2349 683.8707 695.3518 725.3300 746.3276 760.9403 781.7114 806.7765 821.2538 840.2817 846.0467 876.0930 908.2306 923.5132 945.3713 970.3747 976.5119 987.2897 998.3241 1022.9964 1054.0776 1073.0358 1086.5937 1149.5401 1163.5678 1176.8245 1183.7272 1195.8423 1201.2831 1227.1859 1229.3340 1245.3438 1249.4272 1290.5923 1310.2402 1339.3465 1346.1115 1364.1781 1376.2761 1395.2785 1409.5561 1419.1603 1431.0186 1434.3333 1445.5852 1498.6068 1522.5711 1580.5740 1598.6047 1611.4248 1623.8234 3026.4635 3082.8493 3126.8022 3129.9869 3141.0258 3144.9356 3150.8405 3164.1873 3184.0594 3491.1600 3545.0591
redmass: 6.9323 9.1332 5.7597 8.2039 5.7327 5.1955 8.6412 4.0197 5.2141 1.2052 5.0938 7.1782 7.8131 5.6121 5.9866 6.5614 5.6121 4.5396 4.6210 5.2261 5.1415 4.5653 1.7018 2.3161 3.7071 3.9877 5.3183 5.4108 6.3583 6.0317 4.6512 6.1999 3.3436 6.7220 1.4135 2.8075 3.1222 2.8370 4.9270 1.6256 4.8408 1.5126 5.4602 6.2591 1.3462 1.3767 1.4156 5.3021 2.7513 3.2613 2.0705 2.3074 1.3161 1.2418 1.3499 1.3093 2.5692 1.9659 1.6679 1.6479 1.7817 2.4294 2.0196 1.2236 3.6134 1.7287 1.8840 4.1111 5.9121 2.1608 4.1248 3.3740 3.4901 3.6204 6.0952 7.9968 6.4067 6.8880 7.0283 1.0838 1.0866 1.0868 1.0870 1.0918 1.0907 1.0980 1.0992 1.0954 1.0650 1.0665
irintensity: 0.1108 1.2396 1.3045 2.8946 4.4062 1.5764 4.7626 1.9666 12.8442 69.4356 7.7278 2.6958 6.4389 3.7769 0.9789 0.4869 2.3024 1.8102 0.8785 5.5190 2.0456 1.9591 46.5030 54.6581 30.7764 13.1773 13.8702 1.9196 7.9572 7.3428 27.1919 1.0718 9.7296 13.8304 25.2628 11.9043 7.1402 13.4052 9.0126 105.0856 55.5266 8.7495 59.7792 20.1312 1.5516 1.0534 0.2637 4.3308 15.7980 0.7424 2.9265 61.5913 6.2797 6.4050 19.4915 58.9137 325.4107 35.9991 137.9918 14.8440 14.4051 6.4555 16.6728 26.2238 110.1079 17.0345 24.4716 9.0807 11.9403 4.8627 36.3198 2.8983 1.8053 0.6238 12.4979 13.8087 10.6346 40.8546 0.4800 12.9141 8.8846 0.4563 1.5280 9.9425 5.5208 28.5280 29.6752 2.2929 26.8545 9.1874
temp: 298.150 k
press: 1.00000 atm
elementType: 8 8 8 8 7 6 6 6 6 6 6 6 6 6 6 6 6 6 6 6 6 1 1 1 1 1 1 1 1 1 1 1
symmnumber: 1
zpe: 617484.0 jmol-1
zpe.correction: 0.235187 hartree
zpe.thermalcorrener: 0.251135 hartree
zpe.thermalcorrenthalpy: 0.252079 hartree
zpe.thermalcorrgfe: 0.192524 hartree
zpe.sumelectzpe: -970.441805 hartree
zpe.sumelectthermal: -970.425858 hartree
zpe.sumelectthermalent: -970.424913 hartree
zpe.sumelectthermalfe: -970.484468 hartree
dipole: 4.8361 4.5827 0.3738
dipole: 6.6730
quadrupole: -121.4129 -111.1625 -126.6704
quadrupole: -4.3364 0.8137 1.4108
quadrupole: -1.6643 8.5861 -6.9218 -4.3364 0.8137 1.4108
hfenergy: -970.6769924 hartree
pointgroup: C01 [X(C16H11N1O4)]
dipole: 1.8946188 1.8053684 0.208798 debye
polarizability: 318.1246001|-7.5912361|224.1166583|-9.8814729|11.2109482|96.5285365 unknown
InChI: InChI=1S/C16H11NO4/c18-15-10-3-1-2-8-4-5-9-6-7-11(17(20)21)14(16(15)19)13(9)12(8)10/h1-7,15-16,18-19H
charge 0 multiplicity 1
32 atoms
O  -0.943221 -2.020971 -1.63589
O  0.34231 -2.471355 1.795024
O  -4.658138 0.138267 0.444904
O  -3.581642 -1.423183 -0.813565
N  -3.590204 -0.328363 -0.106872
C  -0.894016 -1.69457 -0.198962
C  0.447342 -2.227277 0.330501
C  0.08807 0.65654 0.0502
C  -1.070398 -0.186361 -0.017079
C  1.428808 0.082303 -0.008566
C  1.629835 -1.331492 0.035066
C  -0.059021 2.088827 0.119746
C  2.571442 0.952809 -0.103655
C  -2.338504 0.439807 0.034736
C  2.924951 -1.860913 -0.083748
C  1.112483 2.93062 0.072944
C  2.376549 2.383786 -0.059268
C  -1.366747 2.658392 0.210872
C  3.876864 0.386301 -0.218775
C  -2.498047 1.847597 0.185519
C  4.051026 -1.004423 -0.224561
H  -1.686126 -2.241356 0.345102
H  0.587188 -3.232689 -0.096157
H  3.063466 -2.947087 -0.048077
H  0.97702 4.016621 0.124752
H  3.258283 3.032294 -0.119883
H  -1.472092 3.746156 0.281937
H  4.741748 1.054747 -0.299981
H  -3.50792 2.259725 0.252178
H  5.053291 -1.434283 -0.32154
H  -1.904146 -1.953741 -1.887965
H  0.487745 -1.615331 2.275165
