program: Gaussian 09
title: 000184504
version: EM64L-G09RevD.01
frameworkgroup: C1[X(C4H12O7P2)]
method: RPBEPBE
basis: SDD
operation: Freq
keyword: #p
keyword: freq=noraman
keyword: PBEPBE/SDD
title: #p freq=noraman PBEPBE/SDD
converged: YES YES NO NO
title: Mulliken charges:
elementType: P P O O O O O O O C C C C H H H H H H H H H H H H
charge: 1.356677 1.310169 -0.477702 -0.647292 -0.770609 -0.662202 -0.755580 -0.586230 -0.566310 -0.634391 -0.018088 -0.689435 -0.710365 0.236482 0.239572 0.249707 0.222019 0.220962 0.252183 0.269673 0.437488 0.429698 0.423581 0.445621 0.424372
chargesum: 0.00000
title: Mulliken charges with hydrogens summed into heavy atoms:
elementType: P P O O O O O O O C C C C
charge: 1.356677 1.310169 -0.040214 -0.217594 -0.347028 -0.216582 -0.331208 -0.586230 -0.566310 -0.634391 0.218394 0.021862 0.032453
polarizability: 1.23124722e+02 1.01772329e+00 1.11093228e+02 -1.06336774e+00 -1.65289938e+00 1.06716525e+02
1716.lowfreq: -12.1882 -0.0024 -0.0020 -0.0016 4.7943 13.0203 31.2891 42.1795 109.0326
frequency: 30.7863 41.8959 109.0250 128.6099 153.1380 160.8945 178.0134 194.6709 210.9529 225.8630 232.5555 249.1225 254.5601 282.6449 291.2973 296.0024 309.1127 328.9740 347.7826 350.4809 375.1030 401.3602 416.3101 420.4712 494.5768 523.9281 553.7962 639.7031 650.4201 672.9236 722.3393 739.0428 759.8033 772.2583 849.2239 910.4475 941.5867 965.4415 982.3684 996.6921 997.8324 1054.1592 1060.8031 1122.7263 1131.3437 1147.8133 1193.4149 1206.3755 1284.5770 1308.6443 1377.4250 1387.1655 1410.3978 1472.6079 1477.4980 1491.0491 1500.5427 2967.8481 2989.0448 2990.9244 3083.0856 3088.7995 3097.1512 3102.7577 3170.5227 3270.5274 3319.9289 3609.0320 3650.3199
redmass: 7.0564 8.9222 2.6947 1.9253 4.9403 5.0099 8.8259 2.3347 4.4871 1.2340 3.8023 4.4221 1.1920 6.3955 3.6238 3.6757 3.6708 4.8996 4.8424 5.7836 1.7919 5.3284 3.6505 5.3610 3.4643 4.1970 1.0987 5.9658 5.1007 1.4443 1.6079 6.7998 3.1782 5.3964 3.0354 2.6684 1.2819 1.3913 1.4094 3.1040 1.7361 2.0960 5.5549 1.8277 2.0043 1.7665 2.0017 1.1345 1.4409 1.2536 1.2109 1.1806 1.1849 1.0420 1.0486 1.0409 1.0513 1.0837 1.0359 1.0360 1.0998 1.0987 1.1015 1.1001 1.0654 1.0660 1.0631 1.0662 1.0670
irintensity: 3.6033 2.1891 0.3958 43.9966 9.3000 7.7446 1.6199 85.7624 1.3290 2.9436 18.1616 0.6088 2.0237 18.2228 9.7968 12.4704 14.8501 14.0338 84.2513 17.8156 89.7794 42.7577 21.2406 27.8080 18.1934 2.7254 24.7161 52.4422 58.2650 278.5445 38.1395 124.5229 170.5001 185.4533 15.1442 27.0020 25.4845 9.8757 41.4885 76.5923 56.4332 59.0967 195.7674 27.1333 38.8682 86.5008 3.9510 261.5093 2.3582 44.7982 131.3756 30.6208 24.3645 7.9490 1.9349 11.4294 16.4314 7.5717 14.4983 23.0433 5.4435 27.7062 3.9981 13.6988 320.3099 265.4752 82.0581 86.9954 108.6967
temp: 298.150 k
press: 1.00000 atm
elementType: 15 15 8 8 8 8 8 8 8 6 6 6 6 1 1 1 1 1 1 1 1 1 1 1 1
symmnumber: 1
zpe: 467312.2 jmol-1
zpe.correction: 0.177990 hartree
zpe.thermalcorrener: 0.194908 hartree
zpe.thermalcorrenthalpy: 0.195852 hartree
zpe.thermalcorrgfe: 0.134748 hartree
zpe.sumelectzpe: -1367.562561 hartree
zpe.sumelectthermal: -1367.545643 hartree
zpe.sumelectthermalent: -1367.544699 hartree
zpe.sumelectthermalfe: -1367.605803 hartree
dipole: -1.9240 0.8020 1.9174
dipole: 2.8322
quadrupole: -104.1803 -89.2500 -92.0832
quadrupole: 0.7529 -9.5254 8.3063
quadrupole: -9.0092 5.9212 3.0880 0.7529 -9.5254 8.3063
hfenergy: -1367.7405511 hartree
pointgroup: C01 [X(C4H12O7P2)]
dipole: 0.7280301 -0.2059918 0.8180147 debye
dipolederiv: 1.4743751 0.123555 -0.1608069 -0.0929803 1.5976955 -0.0122894 0.0307176 -0.0543518 1.6008385 1.7374329 -0.0815669 0.1338803 -0.0016462 1.5285552 -0.0804052 0.1129541 0.09862 1.423976 -0.630507 -0.0450986 -0.0734643 -0.0711432 -0.5918484 -0.0852786 -0.0099828 -0.1038829 -0.9244919 -0.6011842 0.0065825 -0.0103534 0.0921437 -0.75941 -0.2179846 0.0603381 -0.236741 -0.8088456 -0.7748426 -0.1160417 0.1827506 -0.1359499 -0.8707233 0.2118613 0.1808585 0.2447886 -0.8051723 -0.8106068 -0.0038055 0.0721469 -0.0215541 -1.0478574 0.1788365 0.0279154 0.0846764 -0.5817877 -0.8876563 0.0815029 -0.3147135 0.0771887 -0.6562842 0.0201974 -0.3701102 -0.0180856 -0.9486739 -0.694129 -0.0048644 -0.0209328 0.079223 -0.660989 0.0909569 -0.1232145 0.0043215 -0.5816324 -0.7564159 0.0184334 0.1103729 -0.0225653 -0.6096365 -0.0705788 0.046555 -0.0670087 -0.6025506 -0.025384 0.1016813 0.0517336 0.0702793 0.1572024 -0.0436077 0.1017327 -0.0984725 0.381106 -0.1043104 0.040545 -0.0035755 0.0589397 0.0525804 -0.0710127 0.0469498 0.1065673 -0.0040083 -0.0157772 -0.0294374 0.0467117 -0.1135761 -0.0460284 0.0359592 0.0216067 -0.055747 0.0072682 -0.0211886 -0.0536842 0.0296727 -0.0353292 -0.0382584 -0.0378106 0.0176077 -0.0119648 -0.0833289 -0.0409069 0.0196184 -0.0607688 0.0742517 -0.0143566 0.0292809 -0.0611898 0.0169302 0.0191799 0.0872236 0.0091318 -0.0258057 0.0157748 0.1016475 -0.0837969 0.0188482 -0.0296796 -0.1063762 0.0055025 0.0576439 -0.0278688 0.0982648 0.0630283 0.0327472 -0.082327 0.0371217 0.0505403 0.0505061 -0.0427103 0.0205917 -0.0739427 -0.14805 0.0207829 0.0259056 -0.0055032 0.0982438 0.0917899 -0.0598975 -0.0175764 -0.0569605 -0.1553779 -0.027598 -0.0062205 0.0174192 0.0842661 -0.0020851 0.0413278 -0.0729846 0.0832866 0.0825278 0.0542225 -0.0225283 0.024507 0.0564324 0.0154525 0.0233033 0.0999049 -0.0172537 0.1283724 0.0379864 0.0660988 0.0326228 0.0321848 0.4966177 0.0343168 0.0085272 0.0865097 0.2994518 0.0050937 -0.0642633 -0.0050678 0.388368 0.352883 -0.0129616 -0.0199029 -0.0835558 0.3914564 0.0263544 -0.0617285 0.0775717 0.3417117 0.188237 0.0011257 -0.0569534 -0.0018571 0.3929825 0.0112934 -0.0772674 0.0140545 0.3155437 0.6182531 -0.0913622 0.0185861 0.0225974 0.3876037 -0.0247312 0.0513968 -0.0921581 0.3237507 0.2467209 -0.0173377 0.0908281 -0.0301451 0.4157159 -0.0004792 0.0693473 0.0194621 0.3234579 unknown
polarizability: 123.1503161|0.6651821|111.4575082|1.3235959|0.7397547|106.3266509 unknown
InChI: InChI=1S/C4H12O7P2/c1-3(2)4(5,12(6,7)8)13(9,10)11/h3,5-7,9-10H,1-2H3
charge 0 multiplicity 1
25 atoms
P  -1.280674 0.94282 -0.486882
P  1.830072 0.003235 -0.349203
O  0.036884 0.186019 1.712808
O  -1.542701 2.046406 0.791775
O  -0.241637 1.834095 -1.604874
O  2.083549 1.690246 -0.483847
O  2.513316 -0.263161 1.240595
O  -2.579697 0.426191 -1.237972
O  2.422568 -0.924925 -1.49239
C  0.011495 -0.276124 0.32472
C  -0.410735 -1.759525 0.191985
C  -1.703515 -2.032996 0.99994
C  -0.558642 -2.218976 -1.281439
H  0.414399 -2.342779 0.654584
H  -1.604251 -1.712986 2.050483
H  -2.570852 -1.516235 0.549418
H  -1.915492 -3.116767 0.983832
H  -0.77457 -3.301814 -1.29136
H  -1.403445 -1.705093 -1.773311
H  0.364046 -2.057322 -1.864772
H  0.962315 0.020374 2.077404
H  -1.013446 1.740375 1.593859
H  -0.711477 2.167672 -2.40969
H  1.361554 2.099744 -1.069573
H  3.496335 -0.241276 1.321013
