program: Gaussian 09
title: 000184502
version: EM64L-G09RevD.01
frameworkgroup: C1[X(C12H23NO4)]
method: RPBEPBE
basis: SDD
operation: Freq
keyword: #p
keyword: freq=noraman
keyword: PBEPBE/SDD
title: #p freq=noraman PBEPBE/SDD
converged: YES YES NO NO
title: Mulliken charges:
elementType: O O O O N C C C C C C C C C C C C H H H H H H H H H H H H H H H H H H H H H H H
charge: -0.258570 -0.243992 -0.306420 -0.303466 -0.369464 -0.351552 -0.377457 -0.362266 -0.388695 -0.356513 -0.503403 -0.697375 0.263592 -0.286183 -0.287993 0.336392 -0.610727 0.179032 0.181767 0.244462 0.184676 0.218047 0.181227 0.200601 0.220528 0.192613 0.183179 0.228573 0.229276 0.210438 0.212447 0.210828 0.237285 0.229675 0.220378 0.278766 0.327649 0.228932 0.272012 0.231699
chargesum: 0.00000
title: Mulliken charges with hydrogens summed into heavy atoms:
elementType: O O O O N C C C C C C C C C C C C
charge: -0.258570 -0.243992 -0.306420 -0.303466 -0.041816 0.009247 0.051681 0.037008 0.032434 0.019279 -0.045554 -0.063662 0.263592 0.180777 0.211152 0.336392 0.121917
polarizability: 1.71389970e+02 -3.91980243e+00 1.50565339e+02 -7.16713713e+00 7.10997584e+00 1.28275285e+02
1716.lowfreq: -9.2073 -6.2390 -3.7576 -0.0007 -0.0005 0.0003 14.4713 19.9770 30.4402
frequency: 9.8686 19.6936 30.4177 36.2563 50.3112 56.1639 79.2087 82.5025 90.1443 96.2345 112.3890 126.5687 146.4994 156.0722 199.0051 212.5095 228.8140 239.7651 251.7276 303.9084 326.1007 342.9149 401.6608 413.3832 443.8333 479.9589 495.9272 579.3984 586.6479 644.8779 660.6518 693.3032 723.2213 740.0529 748.5780 792.1151 818.2372 855.8615 864.1792 891.6464 901.7948 904.7964 968.6007 996.8088 1004.0971 1027.0949 1034.1825 1044.0634 1062.7895 1081.8170 1097.6643 1099.5922 1114.4551 1118.4867 1126.3065 1145.6360 1171.1760 1199.0012 1202.5973 1214.9143 1236.7734 1246.9359 1250.0101 1272.3537 1282.5598 1290.2464 1293.8509 1309.7477 1319.2520 1334.2682 1354.1090 1355.0159 1363.9378 1367.3770 1385.5492 1426.9145 1428.8582 1446.2346 1453.1129 1459.6280 1462.7034 1464.2535 1467.3451 1474.4320 1474.6764 1481.6471 1483.3358 1489.5160 1519.2144 1641.7590 1679.1686 2946.8818 2953.7740 2963.5311 2966.4623 2971.1770 2979.3625 2980.4795 2991.3956 2998.8817 3003.6449 3017.1152 3025.5142 3027.3291 3036.1724 3054.5196 3056.9864 3068.0913 3068.6384 3082.0246 3094.2110 3111.1970 3114.1060 3577.0313
redmass: 4.0771 4.5010 4.1577 3.8363 9.4464 1.7731 2.0332 2.9850 2.8493 1.8519 3.0869 1.9147 2.5967 3.1202 2.5187 4.3621 1.1271 2.9148 4.1165 2.9659 4.1477 2.7128 2.4237 3.1142 3.5402 3.5061 3.0054 1.1156 3.7915 5.3716 2.5013 12.1415 1.0764 1.3726 2.7683 1.3428 3.0958 2.4625 1.8000 1.8487 1.6586 3.2258 1.6484 2.4929 2.5654 2.3177 2.4884 2.8366 2.4593 2.3420 2.5346 2.7917 2.7362 2.6447 1.2873 1.7116 2.0302 1.5510 1.9458 1.8242 1.1676 1.3624 1.3185 1.0967 1.1957 1.0509 1.2316 1.1655 1.2884 1.3938 1.2825 1.6203 1.4169 1.4088 1.2170 1.0976 1.1631 1.0903 1.1127 1.0777 1.0756 1.2344 1.0694 1.0802 1.0451 1.0815 1.0482 1.0853 1.4685 9.7340 8.4679 1.0586 1.0593 1.0615 1.0645 1.0358 1.0357 1.0625 1.0918 1.0989 1.0618 1.0587 1.0977 1.0608 1.1034 1.1035 1.1026 1.1001 1.0997 1.0999 1.1065 1.0983 1.1035 1.0772
irintensity: 0.7153 0.0450 0.6683 2.2890 0.5988 0.8567 4.5297 0.2552 0.8071 5.9654 0.3352 0.9937 0.1091 2.0824 2.3246 3.2869 0.0107 2.6431 4.0168 4.8342 14.8953 20.4763 5.6987 7.0224 1.6002 0.1492 5.3451 134.7032 3.1057 12.1441 2.7512 25.1065 19.1457 1.9344 13.0884 6.1028 1.6608 7.1030 9.7395 6.8507 19.9724 45.3717 21.7854 1.5128 31.2114 3.5674 26.7487 72.6560 31.4685 4.7472 51.8638 93.7917 85.3507 42.7266 0.2041 17.4592 46.7018 13.4581 129.2722 106.3577 25.0460 21.6077 12.7385 7.7527 2.2048 0.5858 3.0596 1.3731 1.3595 1.9088 1.8558 3.0111 2.8522 1.5333 11.2799 17.6795 36.9173 14.8888 27.3030 2.1626 3.4040 88.0496 3.9924 3.7678 10.5095 7.8180 13.9422 18.6755 157.6077 168.1049 313.0277 12.7447 14.2649 17.7837 72.3731 41.8320 58.7512 54.1184 34.7973 4.0806 24.6384 7.9072 9.5632 63.6542 33.9122 80.1632 28.1838 83.5377 70.9931 31.1755 7.3472 5.0597 10.1123 39.9987
temp: 298.150 k
press: 1.00000 atm
elementType: 8 8 8 8 7 6 6 6 6 6 6 6 6 6 6 6 6 1 1 1 1 1 1 1 1 1 1 1 1 1 1 1 1 1 1 1 1 1 1 1
symmnumber: 1
zpe: 898095.2 jmol-1
zpe.correction: 0.342066 hartree
zpe.thermalcorrener: 0.363136 hartree
zpe.thermalcorrenthalpy: 0.364080 hartree
zpe.thermalcorrgfe: 0.287487 hartree
zpe.sumelectzpe: -825.360390 hartree
zpe.sumelectthermal: -825.339320 hartree
zpe.sumelectthermalent: -825.338376 hartree
zpe.sumelectthermalfe: -825.414970 hartree
dipole: 0.2077 2.8288 2.9796
dipole: 4.1138
quadrupole: -100.6698 -92.9723 -106.5797
quadrupole: 3.5327 -0.0156 -0.5143
quadrupole: -0.5959 7.1016 -6.5058 3.5327 -0.0156 -0.5143
hfenergy: -825.7024567 hartree
pointgroup: C01 [X(C12H23N1O4)]
dipole: 0.0988302 1.0346372 -1.2406798 debye
polarizability: 172.1628661|0.016779|149.0205788|-8.0179222|-7.2330498|129.0471492 unknown
InChI: InChI=1S/C12H23NO4/c1-3-4-5-6-7-8-11(14)16-9-10-17-12(15)13-2/h13H,3-10H2,1-2H3
charge 0 multiplicity 1
40 atoms
O  -2.739302 -0.090368 -0.595511
O  -3.052021 -1.299615 1.374138
O  -1.379568 2.615591 -0.033783
O  0.464513 1.323729 0.702413
N  0.651016 2.948537 -0.987204
C  1.814964 -1.735902 -0.565165
C  0.392758 -1.99794 -0.021857
C  2.852643 -1.500293 0.554512
C  -0.653014 -2.148901 -1.147625
C  4.274083 -1.211166 0.020046
C  -2.091926 -2.411618 -0.624261
C  5.30773 -0.989966 1.145818
C  -2.662443 -1.261338 0.184772
C  -3.320684 1.100086 0.077416
C  -2.281203 1.879165 0.880067
C  -0.023268 2.210972 -0.044624
C  2.085351 2.778898 -1.232479
H  2.138071 -2.586783 -1.202856
H  1.786174 -0.841344 -1.222458
H  0.112526 -1.154094 0.637229
H  0.396253 -2.912766 0.607074
H  2.512725 -0.649829 1.179374
H  2.887751 -2.388673 1.219632
H  -0.370309 -2.992853 -1.808548
H  -0.661225 -1.23634 -1.773536
H  4.602432 -2.052248 -0.625106
H  4.240306 -0.314823 -0.634717
H  -2.766091 -2.589043 -1.484257
H  -2.111973 -3.30577 0.022272
H  5.383961 -1.885283 1.791451
H  5.014325 -0.139375 1.789743
H  6.314813 -0.778386 0.74056
H  -3.720048 1.711222 -0.746945
H  -4.132832 0.775257 0.753941
H  -2.788755 2.647772 1.490058
H  -1.687077 1.217011 1.532369
H  0.110818 3.630341 -1.52007
H  2.280559 2.501946 -2.284896
H  2.448684 1.968624 -0.580591
H  2.64708 3.701369 -0.994597
