program: Gaussian 09
title: 000184499
version: EM64L-G09RevD.01
frameworkgroup: C1[X(C10H19NO4)]
method: RPBEPBE
basis: SDD
operation: Freq
keyword: #p
keyword: freq=noraman
keyword: PBEPBE/SDD
title: #p freq=noraman PBEPBE/SDD
converged: YES YES NO NO
title: Mulliken charges:
elementType: O O O O N C C C C C C C C C C H H H H H H H H H H H H H H H H H H H
charge: -0.258649 -0.243978 -0.306580 -0.304614 -0.369686 -0.352420 -0.376856 -0.338331 -0.500947 -0.712596 0.264229 -0.286291 -0.287216 0.336760 -0.609301 0.243577 0.180923 0.217704 0.197082 0.188276 0.185032 0.228159 0.228494 0.205966 0.241199 0.203501 0.237316 0.230005 0.220341 0.278534 0.327676 0.228971 0.231131 0.272590
chargesum: 0.00000
title: Mulliken charges with hydrogens summed into heavy atoms:
elementType: O O O O N C C C C C C C C C C
charge: -0.258649 -0.243978 -0.306580 -0.304614 -0.042010 0.072080 0.037930 0.034977 -0.044294 -0.061931 0.264229 0.181030 0.211658 0.336760 0.123392
polarizability: 1.40706213e+02 5.33412260e+00 1.34939716e+02 -9.64977363e+00 1.21566502e+00 1.08348304e+02
1716.lowfreq: -14.0380 -4.9170 -0.0006 -0.0004 -0.0002 4.0357 14.6412 27.5802 30.5649
frequency: 11.6999 27.5336 30.4023 48.1599 58.2787 71.7926 93.3015 103.6495 114.0846 129.7318 155.3172 168.0237 206.9730 216.8410 242.8844 255.9373 318.2645 334.2158 382.3499 390.7663 418.6787 465.9291 489.2910 580.1509 586.0712 645.5222 660.7886 692.2345 731.6960 747.2213 793.2259 818.7929 848.3824 873.6935 905.9296 916.2080 932.0293 994.6106 1002.9109 1031.5662 1043.0878 1064.6821 1096.1971 1098.8980 1108.4181 1116.7248 1127.1224 1146.2257 1174.3115 1203.3800 1215.8407 1221.6584 1236.1639 1270.8173 1274.5131 1282.6314 1299.0087 1318.5908 1335.4700 1355.3362 1360.7374 1367.9726 1386.1939 1429.2111 1430.7074 1449.4415 1453.6512 1462.8959 1463.1959 1465.0470 1474.9586 1479.1126 1485.2488 1490.6726 1519.5519 1641.9476 1679.0094 2956.3663 2966.8718 2971.1685 2979.6179 2979.9879 3002.2070 3003.6979 3017.2818 3027.5776 3027.8098 3052.4445 3057.2964 3063.6772 3077.1767 3082.6417 3093.6858 3112.2943 3114.2116 3577.5781
redmass: 3.9139 4.0075 4.8878 7.3908 4.7406 2.0572 2.5821 4.2421 1.2009 2.4687 3.2596 2.4648 3.4381 2.9838 1.1546 4.3313 2.9477 2.7525 3.1003 2.4964 3.2736 4.2591 2.8804 1.1167 3.8172 5.3592 2.4721 12.0769 1.1679 3.9520 1.4048 3.1098 2.0357 2.4646 3.2782 1.9339 1.4550 2.1328 2.6860 2.4485 2.9277 2.5222 2.2653 3.1940 2.0812 3.4651 1.2820 1.7077 2.1764 2.0488 1.4177 1.7155 1.1782 1.1410 1.2045 1.2369 1.0932 1.3057 1.4055 1.2763 1.5427 1.3272 1.2167 1.0976 1.1639 1.0904 1.1102 1.0825 1.0732 1.2532 1.0537 1.0773 1.0450 1.0634 1.4527 9.7268 8.4496 1.0583 1.0625 1.0366 1.0557 1.0423 1.0915 1.0665 1.0586 1.0977 1.0619 1.1034 1.1026 1.0995 1.1006 1.0997 1.1065 1.0982 1.1036 1.0772
irintensity: 1.1698 1.2790 0.1480 0.8606 2.8518 2.3396 7.8001 0.0777 1.3723 0.3375 2.4318 0.3554 0.9119 6.7700 0.6805 4.8054 14.8047 20.9856 1.3994 5.1430 9.3661 1.5133 5.9052 136.7851 2.8986 12.1100 2.9190 25.8837 15.1566 17.5262 1.6775 2.1764 4.9036 13.5039 42.2814 12.5743 39.6032 2.7310 24.7846 30.4634 79.2835 34.0425 29.2529 105.5729 12.9272 117.0774 0.1022 19.0377 63.3190 147.3079 28.0469 74.1864 34.9626 8.0561 8.6945 5.9327 1.5855 1.4614 3.3475 2.3812 3.3292 1.3821 15.4726 17.4180 35.2338 14.5046 25.6261 1.0179 8.3952 97.4608 5.4106 10.1687 13.3297 13.2652 152.0936 169.5947 320.0386 24.8200 25.5929 39.5496 24.7835 100.0145 29.5461 20.9818 9.5471 0.5854 63.3213 41.4527 36.6221 63.4423 55.3429 36.9780 7.4633 4.2503 10.2004 39.7882
temp: 298.150 k
press: 1.00000 atm
elementType: 8 8 8 8 7 6 6 6 6 6 6 6 6 6 6 1 1 1 1 1 1 1 1 1 1 1 1 1 1 1 1 1 1 1
symmnumber: 1
zpe: 751777.4 jmol-1
zpe.correction: 0.286337 hartree
zpe.thermalcorrener: 0.304568 hartree
zpe.thermalcorrenthalpy: 0.305513 hartree
zpe.thermalcorrgfe: 0.236418 hartree
zpe.sumelectzpe: -746.914161 hartree
zpe.sumelectthermal: -746.895930 hartree
zpe.sumelectthermalent: -746.894986 hartree
zpe.sumelectthermalfe: -746.964081 hartree
dipole: 2.2376 -1.7764 -3.0600
dipole: 4.1864
quadrupole: -84.5689 -82.2217 -94.1339
quadrupole: -3.1286 -0.4375 -1.1371
quadrupole: 2.4059 4.7532 -7.1590 -3.1286 -0.4375 -1.1371
hfenergy: -747.2004983 hartree
pointgroup: C01 [X(C10H19N1O4)]
dipole: 0.8662567 -0.6096377 -1.2612484 debye
polarizability: 139.5980292|6.0296132|135.2588372|-10.4819577|1.7937451|109.1373665 unknown
InChI: InChI=1S/C10H19NO4/c1-3-4-5-6-9(12)14-7-8-15-10(13)11-2/h11H,3-8H2,1-2H3
charge 0 multiplicity 1
34 atoms
O  -1.717564 -1.061672 -0.770352
O  -2.89398 -0.512983 1.167424
O  0.985247 -2.375595 -0.114581
O  1.561247 -0.311167 0.894764
N  2.850984 -1.291115 -0.810317
C  -0.53714 2.29905 0.253899
C  -1.350453 1.892888 -0.994551
C  0.751336 3.073412 -0.10379
C  -2.672301 1.149257 -0.659134
C  1.615227 3.385187 1.137471
C  -2.46283 -0.181471 0.039607
C  -1.475842 -2.414531 -0.205258
C  -0.247642 -2.450787 0.700942
C  1.79196 -1.226042 0.062091
C  3.885996 -0.2557 -0.862171
H  -0.250999 1.394933 0.825018
H  -1.168174 2.919397 0.924315
H  -0.732244 1.249072 -1.648834
H  -1.609004 2.797541 -1.581183
H  1.345084 2.46607 -0.817749
H  0.488043 4.014022 -0.63151
H  -3.229987 0.956523 -1.595944
H  -3.306399 1.7662 0.000619
H  1.049208 3.986001 1.874582
H  1.923643 2.444852 1.629892
H  2.526334 3.9524 0.868932
H  -1.33295 -3.057799 -1.087511
H  -2.363697 -2.732295 0.372031
H  -0.206064 -3.421284 1.227212
H  -0.256309 -1.628018 1.435766
H  2.894997 -2.099694 -1.430676
H  3.944735 0.201159 -1.867284
H  4.878446 -0.664633 -0.5960
H  3.62189 0.527126 -0.13362
