program: Gaussian 09
title: 000184498
version: EM64L-G09RevD.01
frameworkgroup: C1[X(C7H12ClNO4)]
method: RPBEPBE
basis: SDD
operation: Freq
keyword: #p
keyword: freq=noraman
keyword: PBEPBE/SDD
title: #p freq=noraman PBEPBE/SDD
converged: YES YES NO NO
title: Mulliken charges:
elementType: Cl O O O O N C C C C C C C H H H H H H H H H H H H
charge: -0.031718 -0.314903 -0.258448 -0.320380 -0.220362 -0.366149 0.033065 -0.312444 -0.709784 0.339908 0.373955 -0.699924 -0.607446 0.257454 0.252707 0.223534 0.243675 0.214377 0.226056 0.330054 0.327312 0.284795 0.266381 0.240978 0.227308
chargesum: 0.00000
title: Mulliken charges with hydrogens summed into heavy atoms:
elementType: Cl O O O O N C C C C C C C
charge: -0.031718 -0.314903 -0.258448 -0.320380 -0.220362 -0.036095 0.290519 0.163796 -0.025676 0.339908 0.373955 -0.087817 0.127221
polarizability: 1.18849795e+02 1.76836057e+01 1.08686560e+02 -1.12884213e+00 9.24455469e+00 8.35652181e+01
1716.lowfreq: -7.6444 -4.1606 -0.0013 0.0011 0.0021 2.9646 20.4393 44.0471 48.9659
frequency: 20.3591 43.9882 48.9330 77.8668 84.0808 94.4128 98.7630 144.0826 166.2241 176.6458 202.4843 230.7666 263.3682 289.8098 312.3613 358.2776 413.6673 472.1453 496.9645 536.9748 588.1564 639.5394 668.6152 695.0630 731.5520 805.0402 825.2645 881.6907 911.6522 924.9106 937.3314 977.6908 1077.7244 1091.4910 1110.7318 1126.4683 1127.0665 1140.6502 1146.8142 1166.5761 1210.2022 1242.4742 1285.5372 1291.5903 1332.0527 1364.0211 1395.0540 1422.5017 1429.9853 1436.1695 1462.5541 1464.8854 1478.8496 1482.9408 1519.4608 1668.9892 1679.8176 2984.5190 2995.5664 3027.4335 3035.6139 3058.9181 3064.3809 3091.6642 3107.5287 3111.0136 3116.9615 3146.4999 3575.9705
redmass: 6.5806 3.8642 5.3799 3.0649 2.9613 2.8553 2.0014 3.7967 3.9097 3.9371 1.3166 3.1819 4.6017 4.5076 4.0504 4.1336 2.9647 3.1141 4.5140 3.4924 1.1483 5.5675 4.7132 11.7358 6.2467 3.2975 5.4104 2.4052 2.1390 2.3447 1.8613 4.3096 2.7700 3.0006 3.3475 1.3832 2.1137 1.9787 1.7129 1.2833 2.1627 1.1379 1.3294 1.4367 1.2391 1.3803 1.2206 1.0858 1.1661 1.0900 1.2278 1.0733 1.0478 1.0499 1.4820 9.3439 9.7882 1.0354 1.0363 1.0662 1.0774 1.0579 1.1026 1.1001 1.1013 1.1052 1.0984 1.1064 1.0772
irintensity: 2.6395 1.3996 5.7981 0.5823 2.4857 7.0243 8.4798 5.2599 2.2700 2.0454 0.1076 3.2242 7.5644 9.7981 18.4916 8.3565 9.3508 3.2237 0.2769 12.4649 121.7510 8.9279 7.6665 31.4793 33.4229 7.4086 9.8025 22.9872 2.9811 36.5089 4.4088 84.0836 79.8878 32.9971 341.0898 0.2234 5.4411 31.8789 16.6208 39.7444 227.8968 10.4292 7.8990 19.4146 11.8916 2.6888 18.0192 50.4557 26.3287 18.8498 77.3730 28.2044 10.4382 15.4717 151.3535 90.2136 331.3436 64.0886 16.8064 26.5729 6.2832 3.8702 33.2175 20.5859 15.1725 21.2809 4.9024 1.6768 41.4613
temp: 298.150 k
press: 1.00000 atm
elementType: 17 8 8 8 8 7 6 6 6 6 6 6 6 1 1 1 1 1 1 1 1 1 1 1 1
symmnumber: 1
zpe: 505956.7 jmol-1
zpe.correction: 0.192709 hartree
zpe.thermalcorrener: 0.208068 hartree
zpe.thermalcorrenthalpy: 0.209012 hartree
zpe.thermalcorrgfe: 0.147711 hartree
zpe.sumelectzpe: -1088.631365 hartree
zpe.sumelectthermal: -1088.616006 hartree
zpe.sumelectthermalent: -1088.615062 hartree
zpe.sumelectthermalfe: -1088.676363 hartree
dipole: -4.0226 -0.0644 -0.0710
dipole: 4.0237
quadrupole: -84.9876 -68.2108 -87.4867
quadrupole: 2.1728 -5.1257 4.0820
quadrupole: -4.7593 12.0176 -7.2583 2.1728 -5.1257 4.0820
hfenergy: -1088.824074 hartree
pointgroup: C01 [X(C7H12Cl1N1O4)]
dipole: -1.0042545 -1.2234266 -0.027797 debye
dipolederiv: -0.2103703 -0.1131694 -0.0106353 -0.1408727 -0.4068252 -0.0374365 -0.0597182 -0.1046204 -0.1553081 -0.6059497 0.3280454 0.0260106 0.5598636 -1.5740368 0.0455279 -0.0024161 0.1439505 -0.3794848 -0.5211567 -0.2374633 0.0330573 -0.3973683 -1.4674896 -0.2429956 -0.0013352 -0.1281537 -0.4365684 -0.7054957 0.0171983 0.2319667 0.0050508 -0.6718036 0.157906 0.310676 0.1456214 -0.8314469 -0.3888407 0.0449044 0.1742323 -0.1187781 -0.5910438 -0.0105528 0.0636057 -0.2441393 -0.7907909 -0.8746122 0.3827222 0.1883379 0.3579051 -0.8276007 -0.2338193 0.2135638 -0.2712135 -0.4839408 0.5433464 -0.3072897 0.02632 -0.2456224 0.6286738 0.0768274 -0.0800504 0.3211921 0.2232499 0.3394258 0.2774459 0.0092613 0.1827778 0.5160103 0.0135107 -0.0794559 -0.2204712 0.1551511 -0.0591438 -0.0932713 -0.0226375 -0.0005568 -0.0825596 0.0043499 -0.0126122 -0.0421268 0.0912364 1.0560653 -0.49686 -0.5501437 -0.6993273 1.7693009 -0.0482278 -0.6223004 -0.1675702 1.0974271 0.4180744 0.0305458 -0.2703085 0.3509789 1.5160224 0.1800462 -0.1432919 0.2712127 0.9720006 0.211103 0.1360246 0.060183 0.134176 0.4045305 0.2101063 0.1991697 0.3993539 -0.0239866 0.2651594 -0.0659234 0.0598337 -0.1971979 0.5206302 0.1169262 0.1669908 -0.0600456 0.0526688 0.0245934 0.0429349 0.0134573 0.0084776 0.0597712 0.0599597 0.0235804 -0.0295427 -0.0462586 0.0582119 -0.0748102 0.0226386 -0.038622 0.0710105 -0.0416745 0.0131601 0.0612464 -0.0381833 -0.0119821 0.0805072 0.0139172 0.0403868 -0.115799 -0.0178437 0.0499371 -0.0222297 0.095236 -0.1051825 -0.0580232 -0.0760718 -0.0210768 0.0764518 0.0027147 -0.078188 0.0047311 0.0766289 0.0200569 0.112812 0.0838883 0.0768936 -0.045108 -0.0554746 0.0748534 -0.0762718 0.0419298 0.1064595 -0.0052081 -0.0247715 -0.0090582 0.0659506 0.0154653 0.0015436 0.0933965 -0.1195852 0.3379852 0.028673 0.0397532 0.0720878 0.1352205 0.0327121 0.0519658 0.0681172 0.2149557 0.0917727 -0.0020216 -0.0698571 -0.0175081 0.0101363 -0.0315733 -0.0714578 -0.0339239 0.0936076 0.0073727 -0.0231319 0.0608716 0.0158313 -0.0176348 -0.0796192 0.0364523 -0.0703079 0.0791149 0.1248974 -0.0555534 0.0708469 -0.0032342 0.1086359 -0.0040971 0.0309241 0.0790031 -0.0032185 0.0634528 -0.051869 -0.089279 0.0338177 -0.0847743 -0.0966234 -0.0741987 -0.1197031 -0.0131471 -0.185243 0.1027807 -0.0008714 0.050976 0.0023304 -0.0161148 -0.011398 0.0024948 0.1287124 unknown
polarizability: 94.5461252|2.8209521|131.4599107|-8.2963949|7.2310253|85.0955362 unknown
InChI: InChI=1S/C7H12ClNO4/c1-5(13-7(11)9-2)4-12-6(10)3-8/h5,9H,3-4H2,1-2H3
charge 0 multiplicity 1
25 atoms
Cl 2.447559 3.19578 0.152107
O  -1.675607 -0.981894 0.462435
O  1.419079 -0.653384 -0.28169
O  -1.25733 0.735777 -1.117505
O  0.958694 0.795686 1.502982
N  -2.658998 1.039921 0.746226
C  -0.734643 -1.902094 -0.239377
C  0.675647 -1.768831 0.362246
C  -1.307379 -3.310586 -0.045753
C  -1.817342 0.324462 -0.064556
C  1.381671 0.59828 0.350093
C  1.888061 1.615518 -0.658042
C  -2.969219 2.450842 0.500488
H  -0.70186 -1.613978 -1.306767
H  0.621427 -1.601895 1.452914
H  1.276439 -2.664047 0.13433
H  -2.343933 -3.349423 -0.418728
H  -0.706799 -4.05081 -0.604004
H  -1.314387 -3.595263 1.021536
H  -2.983664 0.58193 1.598203
H  1.051396 1.865502 -1.329942
H  2.73385 1.214167 -1.232175
H  -2.543854 2.728671 -0.47644
H  -2.522889 3.101344 1.275281
H  -4.06142 2.616024 0.474038
