program: Gaussian 09
title: 000184501
version: EM64L-G09RevD.01
frameworkgroup: C1[X(C13H15Cl2NO5)]
method: RPBEPBE
basis: SDD
operation: Freq
keyword: #p
keyword: freq=noraman
keyword: PBEPBE/SDD
title: #p freq=noraman PBEPBE/SDD
converged: YES YES NO NO
title: Mulliken charges:
elementType: Cl Cl O O O O O N C C C C C C C C C C C C C H H H H H H H H H H H H H H H
charge: -0.003199 -0.050218 -0.327887 -0.230026 -0.229264 -0.238713 -0.298114 -0.384375 0.048419 -0.323171 -0.702021 -0.419377 0.277694 0.513716 0.333491 -0.308295 -0.321457 -0.202179 -0.258016 -0.119116 -0.612435 0.253568 0.251402 0.226938 0.219783 0.211673 0.273540 0.233362 0.261387 0.289795 0.286673 0.266538 0.340933 0.228562 0.242714 0.267675
chargesum: 0.00000
title: Mulliken charges with hydrogens summed into heavy atoms:
elementType: Cl Cl O O O O O N C C C C C C C C C C C C C
charge: -0.003199 -0.050218 -0.327887 -0.230026 -0.229264 -0.238713 -0.298114 -0.043442 0.301986 0.155169 0.002975 0.075372 0.277694 0.513716 0.333491 -0.308295 -0.031662 0.084495 0.008522 -0.119116 0.126516
polarizability: 2.08167404e+02 -3.55467034e+01 1.54826523e+02 1.05097889e+01 -5.05562603e+00 1.72973907e+02
1716.lowfreq: -6.2764 -5.0778 -0.6807 -0.0028 -0.0024 -0.0021 12.2073 20.7611 27.4397
frequency: 11.7060 20.6994 27.4050 41.5255 52.0912 62.8087 71.8108 80.5646 89.0472 116.5299 139.8547 152.1322 168.1486 172.1326 173.7034 193.9236 215.2693 225.2626 282.6849 289.5547 312.3340 324.8246 343.9869 359.1851 386.4337 394.7096 412.6908 442.1389 466.5498 493.6223 533.4574 548.8690 588.9010 590.1510 617.1184 670.3611 679.0681 697.5529 703.4024 722.0898 794.8924 796.3330 808.8115 814.8826 861.9330 889.4681 917.9097 934.1196 936.5337 962.0802 981.3683 1007.3073 1031.5686 1067.2121 1085.3079 1095.4371 1116.7438 1125.2387 1146.4604 1150.4160 1159.1927 1184.9883 1206.5005 1230.6062 1245.2838 1257.9771 1266.2361 1292.3182 1339.7511 1348.1468 1363.0890 1364.4526 1385.9983 1387.2725 1428.8775 1448.1670 1454.1960 1461.1133 1464.3059 1464.7395 1482.3162 1485.9751 1516.5162 1570.1429 1590.7911 1632.9566 1679.6559 2984.3974 2991.8520 3028.3312 3032.6157 3038.9008 3063.5145 3085.8279 3112.2269 3114.8781 3115.2456 3115.3370 3157.9225 3176.7825 3179.6637 3562.8826
redmass: 8.2188 5.6338 7.4936 5.0162 4.8700 8.7633 2.4158 2.9266 2.0643 6.4175 4.5090 6.3352 4.4775 4.2059 11.1237 3.5495 1.5948 2.9622 4.0196 3.1294 3.8591 6.6366 5.9422 8.0201 12.0948 3.4760 3.1798 3.3737 3.7818 3.4852 5.7652 4.2512 1.3013 2.9490 7.3058 5.0466 6.4727 11.0254 4.2597 7.1777 7.1289 3.8628 2.6220 1.7966 1.3779 2.3629 3.6573 1.5833 1.3408 3.1040 6.2130 2.4167 4.1011 2.9630 2.6627 5.2775 2.0241 1.3024 1.6913 1.5046 1.7958 2.2996 2.1427 3.5169 1.1497 1.3600 1.4108 1.4054 1.2304 1.4196 2.8383 1.5884 5.4058 1.2164 1.1676 1.0978 1.0802 1.1915 1.1637 2.3532 1.0453 1.0452 1.4497 7.4103 7.4802 9.4501 8.9228 1.0351 1.0367 1.0603 1.0673 1.0758 1.1022 1.0992 1.1074 1.0988 1.1042 1.1003 1.0892 1.0958 1.0942 1.0775
irintensity: 0.1613 0.4943 0.7058 1.2892 5.1325 2.1391 0.7058 0.1041 4.8314 0.6344 2.8856 2.5866 0.6744 1.7064 2.0850 1.5814 0.9569 1.7891 17.4552 6.2556 2.6659 6.4582 11.6888 1.8820 1.6726 4.4107 12.1177 7.4571 5.2447 0.9480 5.6071 6.5331 167.4505 12.2594 38.0947 6.6048 24.4201 27.2068 0.3608 21.9128 27.2110 9.8957 49.7217 29.8515 24.6629 28.0068 50.3207 2.8307 3.1687 18.2990 58.4873 58.6617 72.1425 11.6854 61.9948 172.6264 15.3978 0.3162 6.4225 40.8779 16.2273 138.3666 183.3460 96.6568 6.1308 32.2257 128.8839 5.2781 9.3554 3.2564 17.5547 16.4567 3.0395 27.6886 34.3409 17.1838 17.7531 30.8982 96.0461 181.7825 11.2608 12.4989 118.1103 25.3465 8.3368 145.5026 284.3771 54.9159 18.9785 31.1596 22.0588 14.0585 33.4988 22.7383 12.9697 2.7842 5.1629 7.5234 1.4302 1.3609 0.3408 39.6052
temp: 298.150 k
press: 1.00000 atm
elementType: 17 17 8 8 8 8 8 7 6 6 6 6 6 6 6 6 6 6 6 6 6 1 1 1 1 1 1 1 1 1 1 1 1 1 1 1
symmnumber: 1
zpe: 699039.4 jmol-1
zpe.correction: 0.266250 hartree
zpe.thermalcorrener: 0.288695 hartree
zpe.thermalcorrenthalpy: 0.289639 hartree
zpe.thermalcorrgfe: 0.210572 hartree
zpe.sumelectzpe: -1853.787698 hartree
zpe.sumelectthermal: -1853.765253 hartree
zpe.sumelectthermalent: -1853.764309 hartree
zpe.sumelectthermalfe: -1853.843376 hartree
dipole: 1.5850 -1.1941 -2.1822
dipole: 2.9496
quadrupole: -126.1806 -132.6779 -145.3650
quadrupole: -6.1361 -1.3790 -2.6550
quadrupole: 8.5606 2.0632 -10.6238 -6.1361 -1.3790 -2.6550
hfenergy: -1854.053948 hartree
pointgroup: C01 [X(C13H15Cl2N1O5)]
dipole: 0.1152129 -0.5911272 -0.9919311 debye
polarizability: 151.3293295|-18.839563|174.5607426|25.7215413|-15.5935978|210.0777615 unknown
InChI: InChI=1S/C13H15Cl2NO5/c1-8(21-13(18)16-2)6-20-12(17)7-19-11-4-3-9(14)5-10(11)15/h3-5,8,16H,6-7H2,1-2H3
charge 0 multiplicity 1
36 atoms
Cl 0.892988 3.393671 1.556752
Cl 2.185789 -1.438867 3.962906
O  -2.588623 -0.429069 -0.431584
O  -1.399481 0.987997 -2.616094
O  0.904936 1.834978 -0.94604
O  -0.055172 -0.914377 -2.850734
O  -3.829707 0.627397 1.283443
N  -1.980113 -0.758636 1.73502
C  -3.439214 0.260609 -1.439782
C  -2.647294 0.183033 -2.74493
C  -4.806038 -0.429584 -1.568283
C  0.963077 1.265908 -2.299131
C  -0.195645 0.306305 -2.608786
C  1.212229 1.003919 0.136685
C  -2.880931 -0.117066 0.922672
C  1.244451 1.625492 1.414131
C  1.496005 -0.382215 0.047181
C  1.544707 0.89662 2.577883
C  1.80046 -1.128839 1.208761
C  1.818338 -0.480848 2.456096
C  -2.039967 -0.653634 3.195709
H  -3.566595 1.310846 -1.118698
H  -2.38133 -0.858773 -2.994263
H  -3.217948 0.647013 -3.566009
H  -4.68776 -1.49216 -1.845936
H  -5.423053 0.070837 -2.337455
H  -5.339346 -0.366974 -0.606645
H  1.914944 0.72999 -2.464295
H  0.899936 2.146383 -2.956875
H  1.465356 -0.899871 -0.915798
H  1.567711 1.396334 3.54962
H  2.023539 -2.19647 1.131516
H  -1.226245 -1.28118 1.28642
H  -2.176122 -1.646512 3.662493
H  -1.120479 -0.192975 3.599356
H  -2.900204 -0.016582 3.4550
