program: Gaussian 09
title: 000184481
version: EM64L-G09RevD.01
frameworkgroup: C1[X(C12H15NO2)]
method: RPBEPBE
basis: SDD
operation: Freq
keyword: #p
keyword: freq=noraman
keyword: PBEPBE/SDD
title: #p freq=noraman PBEPBE/SDD
converged: YES YES NO NO
title: Mulliken charges:
elementType: O O N C C C C C C C C C C C C H H H H H H H H H H H H H H H
charge: -0.283088 -0.208702 -0.135607 -0.331451 -0.378018 0.140441 0.268195 -0.672869 -0.648601 -0.443545 -0.362716 0.370527 -0.213700 -0.373484 -0.210532 0.255764 0.201218 0.248964 0.224875 0.203505 0.260487 0.219094 0.213997 0.233035 0.223989 0.278986 0.273787 0.237793 0.239348 0.168305
chargesum: 0.00000
title: Mulliken charges with hydrogens summed into heavy atoms:
elementType: O O N C C C C C C C C C C C C
charge: -0.283088 -0.208702 -0.135607 0.125531 0.095821 0.140441 0.268195 0.010218 0.022420 -0.164560 -0.088928 0.370527 0.024093 -0.134136 -0.042227
polarizability: 1.86922005e+02 -3.09078511e+00 1.63420212e+02 -5.90513000e+00 -6.59244713e+00 8.49275046e+01
1716.lowfreq: -8.6761 -0.1337 -0.0006 -0.0004 0.0001 7.4028 33.0731 52.9982 75.2988
frequency: 32.8387 52.9904 75.2944 89.7676 124.1112 127.6214 143.7684 158.4131 201.7095 219.0763 243.5724 249.8780 299.5059 313.1562 332.0316 382.4411 424.9371 437.6362 462.5728 482.5972 560.5512 619.1618 640.8619 680.9050 691.7936 722.0574 769.6944 783.4425 818.1079 836.4690 916.6140 934.1730 942.4776 950.2703 988.6487 996.3118 1002.2786 1010.0962 1068.9527 1072.7275 1080.5787 1100.1948 1101.3232 1162.7975 1180.9790 1203.9444 1223.3882 1275.8961 1292.8864 1300.2257 1343.6312 1355.1099 1372.4689 1381.8271 1394.9422 1395.7910 1411.9127 1432.5747 1453.1381 1466.2870 1467.7276 1472.3952 1476.4323 1484.3448 1489.4426 1546.5033 1584.2403 1596.7506 1625.0318 2874.7553 2974.4030 2986.0141 2990.1786 3017.8434 3070.2184 3071.0207 3088.0316 3088.7430 3096.2481 3107.8029 3122.1773 3149.0454 3161.6748 3168.9766
redmass: 4.4215 4.3890 4.0913 2.8446 3.7487 4.6874 5.6779 1.6810 1.3806 1.2680 2.9013 3.0011 3.3553 2.9349 2.9374 3.3768 2.9476 6.7124 3.1418 3.8933 3.9438 4.4977 6.4425 5.0071 3.1730 2.7554 1.2549 1.2180 1.6756 2.5730 2.5971 1.3882 1.9472 1.6628 6.0178 1.5631 1.6405 2.5297 2.2345 2.0021 1.8480 1.6836 1.6949 1.8177 1.1482 3.0694 2.3079 1.4937 1.3254 1.3843 1.2444 1.3072 1.6806 1.2192 1.6917 2.1909 2.4599 2.6248 1.1686 1.4329 1.3745 1.0894 1.1602 1.0610 1.0715 5.5284 6.7463 6.1203 6.6803 1.0852 1.0690 1.0364 1.0363 1.0616 1.0942 1.0995 1.0975 1.0996 1.1005 1.1021 1.0888 1.0908 1.0909 1.0982
irintensity: 3.0008 4.0961 3.0860 2.5611 1.5618 3.7874 2.2840 1.1606 0.6213 0.9524 1.9225 8.5057 2.0827 0.2165 0.9650 17.4956 5.9891 0.2684 8.2513 12.2056 3.1875 7.7725 22.8313 10.9160 6.3554 42.7143 3.3829 15.7978 35.5666 12.6803 13.0665 0.8984 1.5369 8.3228 0.6242 5.4008 4.6706 5.3219 16.8242 12.3278 42.4697 4.0348 15.9158 65.7490 0.1770 48.1455 52.4910 70.0122 7.0240 43.2157 4.4468 8.3970 1.3770 27.7182 28.4283 18.4614 100.5781 25.8245 20.2200 2.2191 15.0603 15.0488 3.4323 3.6652 23.2358 189.8533 78.0828 107.8731 72.0337 138.4399 34.1196 34.6543 17.6473 35.4111 0.4056 19.1608 57.0803 10.2283 40.5543 28.4351 5.8929 9.6025 1.1046 12.6428
temp: 298.150 k
press: 1.00000 atm
elementType: 8 8 7 6 6 6 6 6 6 6 6 6 6 6 6 1 1 1 1 1 1 1 1 1 1 1 1 1 1 1
symmnumber: 1
zpe: 642989.3 jmol-1
zpe.correction: 0.244902 hartree
zpe.thermalcorrener: 0.260097 hartree
zpe.thermalcorrenthalpy: 0.261041 hartree
zpe.thermalcorrgfe: 0.202002 hartree
zpe.sumelectzpe: -670.360459 hartree
zpe.sumelectthermal: -670.345263 hartree
zpe.sumelectthermalent: -670.344319 hartree
zpe.sumelectthermalfe: -670.403358 hartree
dipole: 0.2958 -0.1358 3.0657
dipole: 3.0829
quadrupole: -78.5631 -95.6438 -92.4339
quadrupole: 18.0764 -1.0249 -2.6701
quadrupole: 10.3172 -6.7636 -3.5537 18.0764 -1.0249 -2.6701
hfenergy: -670.6053607 hartree
pointgroup: C01 [X(C12H15N1O2)]
dipole: 0.1693663 -0.3093766 1.1604884 debye
polarizability: 186.4988258|-0.094186|162.3643238|-10.1515503|10.4461337|86.4065722 unknown
InChI: InChI=1S/C12H15NO2/c1-3-13(4-2)12(15)11-7-5-6-10(8-11)9-14/h5-9H,3-4H2,1-2H3
charge 0 multiplicity 1
30 atoms
O  1.836601 -1.461028 -1.325035
O  -3.149512 2.258906 0.237449
N  2.020393 0.398278 0.061407
C  3.423832 0.561231 -0.405303
C  1.632208 1.17693 1.263688
C  1.299227 -0.655363 -0.490649
C  -0.155217 -0.852505 -0.121284
C  4.412038 -0.365595 0.335989
C  1.39901 2.679249 0.99501
C  -1.089069 0.199961 -0.018944
C  -0.615442 -2.194652 -0.007897
C  -2.461622 -0.075615 0.219245
C  -1.975462 -2.474955 0.242623
C  -2.902975 -1.416494 0.35789
C  -3.440572 1.035206 0.32566
H  3.445469 0.332034 -1.483419
H  3.704275 1.621302 -0.268257
H  0.728685 0.725569 1.703813
H  2.441032 1.063113 2.014212
H  4.395228 -0.191598 1.427843
H  4.159292 -1.420561 0.139011
H  5.442526 -0.18306 -0.019598
H  2.30126 3.163634 0.580966
H  0.569975 2.844236 0.285528
H  1.145122 3.192781 1.940192
H  -0.794603 1.246207 -0.147499
H  0.109359 -3.004164 -0.142447
H  -2.309586 -3.513386 0.33634
H  -3.964437 -1.623594 0.544542
H  -4.498429 0.711533 0.500323
