program: Gaussian 09
title: 000184440
version: EM64L-G09RevD.01
frameworkgroup: C1[X(C12H8S3)]
method: RPBEPBE
basis: SDD
operation: Freq
keyword: #pfreq=noraman
keyword: PBEPBE/SDD
title: #p freq=noraman PBEPBE/SDD
converged: YES YES NO NO
title: Mulliken charges:
elementType: S S S C C C C C C C C C C C C H H H H H H H H
charge: 0.304841 0.279725 0.279701 0.375762 0.375790 0.420554 0.420518 -0.766880 -0.766864 -0.230512 -0.230497 -0.776067 -0.776049 -0.554841 -0.554823 0.282346 0.282356 0.271139 0.271142 0.279515 0.279521 0.266812 0.266810
chargesum: 0.00000
title: Mulliken charges with hydrogens summed into heavy atoms:
elementType: S S S C C C C C C C C C C C C
charge: 0.304841 0.279725 0.279701 0.375762 0.375790 0.420554 0.420518 -0.484535 -0.484508 0.040628 0.040646 -0.496552 -0.496528 -0.288029 -0.288013
polarizability: 2.01026935e+02 4.06542842e-03 2.11352905e+02 2.14010495e+01 -1.33021916e-03 9.74329582e+01
1716.lowfreq: -5.1015 -0.0011 0.0026 0.0029 4.6265 6.9281 42.2920 44.8053 74.0749
frequency: 42.2796 44.8039 74.0704 101.3561 107.3272 126.4434 252.0775 259.5208 280.7981 343.3477 360.5417 419.5455 443.8132 461.7866 502.9619 586.8956 602.4954 615.2032 646.0131 647.7861 684.5221 685.4369 689.3980 722.6278 729.2016 741.7672 763.3618 781.9554 784.8418 799.2415 808.8391 817.8167 827.7252 850.6392 887.0827 890.3025 891.9127 985.0900 1051.6150 1095.8287 1097.5586 1159.0551 1180.7273 1184.6392 1224.4079 1227.4082 1336.6191 1347.0302 1359.3149 1435.5498 1447.8519 1483.2832 1533.6753 1562.9340 1563.4889 3184.7175 3185.1439 3228.2682 3228.3039 3232.4702 3235.5140 3241.7338 3241.7511
redmass: 9.3561 4.8007 4.3283 8.6178 4.9307 7.2787 8.2442 9.0519 6.0820 7.9610 8.3156 5.1601 4.2649 4.5325 4.9242 9.7882 8.5607 4.7122 4.4366 2.9169 1.5525 1.2282 1.2655 5.4021 2.7777 3.3785 2.4849 1.5322 1.8938 2.9764 5.6463 2.4937 4.4001 4.8468 2.7132 1.5680 1.3224 2.7145 1.6904 1.0926 1.0956 1.1897 1.2444 1.5355 1.4260 1.8168 2.3973 3.3203 7.9924 8.8425 7.9167 6.7086 6.9606 8.1683 7.2253 1.0924 1.0921 1.0953 1.0952 1.0938 1.0974 1.1007 1.1008
irintensity: 0.0135 0.3229 0.1583 1.0886 0.1413 0.1778 0.0236 0.4580 0.5049 0.9587 0.0001 0.1608 0.7421 0.2293 4.5277 3.8315 10.7520 1.0425 9.3946 39.7853 0.8392 9.2821 2.1366 8.9073 2.9670 5.5426 51.6477 158.5759 30.4646 82.5065 49.7600 6.3566 2.6211 1.4367 0.4885 0.5193 4.1788 2.3619 3.1452 7.2915 3.9330 6.1927 7.7337 6.3364 2.7301 4.8231 7.5388 2.9785 0.0351 16.6678 22.4395 0.1124 1.2009 2.8516 0.2550 0.9896 0.8327 1.4496 0.8488 0.0918 1.9276 0.1989 0.7150
temp: 298.150 k
press: 1.00000 atm
elementType: 16 16 16 6 6 6 6 6 6 6 6 6 6 6 6 1 1 1 1 1 1 1 1
symmnumber: 1
zpe: 414683.8 jmol-1
zpe.correction: 0.157945 hartree
zpe.thermalcorrener: 0.171011 hartree
zpe.thermalcorrenthalpy: 0.171955 hartree
zpe.thermalcorrgfe: 0.116470 hartree
zpe.sumelectzpe: -1655.184451 hartree
zpe.sumelectthermal: -1655.171385 hartree
zpe.sumelectthermalent: -1655.170441 hartree
zpe.sumelectthermalfe: -1655.225926 hartree
dipole: -0.0004 -0.3247 0.0001
dipole: 0.3247
quadrupole: -107.1438 -103.6416 -109.0830
quadrupole: 0.0014 2.8281 -0.0010
quadrupole: -0.5210 2.9812 -2.4602 0.0014 2.8281 -0.0010
hfenergy: -1655.342396 hartree
pointgroup: C01 [X(C12H8S3)]
dipole: -0.0002775 -0.1277371 -0.0000439 debye
dipolederiv: -0.2001546 -0.0009954 -0.0531178 -0.0009653 -0.5030845 0.0000604 0.0085666 -0.0003531 0.1367753 -0.2240291 -0.234325 -0.1644109 -0.2561538 -0.1482878 -0.0304738 -0.1703289 0.0093203 -0.0315455 -0.2207863 0.234857 -0.1641269 0.2566748 -0.1515007 0.0314999 -0.1703247 -0.0082041 -0.0316222 0.17164 0.2212722 -0.0012564 0.0796938 -0.0793142 0.0170103 0.0344541 0.020976 0.002741 0.169683 -0.2228256 -0.0014242 -0.0813114 -0.0772343 -0.0171469 0.0344267 -0.0212701 0.0027039 -0.0522471 -0.0145763 -0.0035746 0.1768272 0.1398858 0.0231648 -0.0982633 -0.0728853 0.003017 -0.053348 0.0158759 -0.0037095 -0.1754421 0.1408029 -0.0230801 -0.0978603 0.0736252 0.0030277 -0.0440753 0.2842555 0.0256509 0.2094053 0.2766164 0.0484321 -0.0273113 0.0759072 -0.3081184 -0.0472003 -0.2821911 0.0250824 -0.2074175 0.2797831 -0.0482838 -0.0279976 -0.0752402 -0.308197 -0.2172493 -0.0905029 -0.0509613 -0.1504935 -0.142365 -0.1214404 -0.0030002 -0.059084 -0.0859236 -0.2157056 0.0909808 -0.0501524 0.1509459 -0.144051 0.1217334 -0.0026244 0.0590876 -0.0858584 0.0619952 0.3195954 0.1447141 0.352838 0.0927842 0.0378307 0.1275774 -0.0221987 -0.15808 0.057642 -0.3194764 0.1443497 -0.3526807 0.0972073 -0.0387128 0.1277223 0.0213419 -0.157979 0.0445341 0.0988448 0.3132046 0.0399737 -0.1736332 -0.059471 0.3723151 -0.0236001 0.0805642 0.0435572 -0.1004474 0.3135045 -0.0415404 -0.1727468 0.0573554 0.3724257 0.0210769 0.0807523 -0.008492 0.0075942 -0.0301423 -0.0172388 0.0823458 -0.0105194 -0.0331878 -0.0143707 0.1899669 -0.0084051 -0.0069916 -0.0300409 0.0178531 0.082266 0.0106579 -0.0330883 0.0145344 0.1899835 0.0960518 0.0054523 -0.1138783 -0.0178315 0.1170217 -0.0054003 -0.1151064 0.0228292 0.0517376 0.0961769 -0.0052488 -0.1138302 0.0180364 0.1169647 0.0061898 -0.115229 -0.0220473 0.0516855 0.1468027 -0.0502069 -0.031914 -0.0331411 0.0421276 0.0832606 -0.0426914 0.0611494 0.0921266 0.1473504 0.049546 -0.0324263 0.0325043 0.041655 -0.0830449 -0.0430728 -0.0608799 0.0920401 0.1278341 -0.035234 -0.0605534 -0.0562398 0.0416379 0.0728339 -0.0484663 0.0790832 0.0951505 0.1284252 0.0347471 -0.0609866 0.0557032 0.0411191 -0.0724556 -0.0489351 -0.0787979 0.095052 unknown
polarizability: 185.4753099|0.0754878|211.3526872|42.7458322|-0.1271992|112.9848015 unknown
InChI: InChI=1S/C12H8S3/c1-3-13-5-9(1)11-7-15-8-12(11)10-2-4-14-6-10/h1-8H
charge 0 multiplicity 1
23 atoms
S  0.011923 3.752975 0.000662
S  -3.462302 -1.688516 -1.061368
S  3.450832 -1.711388 1.061088
C  -0.715374 1.200301 -0.141258
C  0.722803 1.195604 0.14151
C  -1.571244 -0.003755 -0.263773
C  1.570873 -0.014018 0.263861
C  -1.229412 2.487083 -0.245428
C  1.245215 2.479013 0.245755
C  -1.520986 -1.139666 0.642772
C  1.513441 -1.14923 -0.643208
C  -2.557628 -0.152127 -1.234038
C  2.556114 -0.169167 1.234189
C  -2.45416 -2.118534 0.363254
C  2.440133 -2.134273 -0.363865
H  -2.267439 2.780529 -0.389387
H  2.285144 2.765697 0.389576
H  -0.816006 -1.203466 1.474351
H  0.808293 -1.207994 -1.4750
H  -2.800769 0.519461 -2.055974
H  2.803506 0.500446 2.056463
H  -2.640498 -3.05809 0.879423
H  2.620544 -3.074784 -0.880405
