program: Gaussian 09
title: 000184415
version: EM64L-G09RevD.01
frameworkgroup: C1[X(C17H13NO2S)]
method: RPBEPBE
basis: SDD
operation: Freq
keyword: #p
keyword: freq=noraman
keyword: PBEPBE/SDD
title: #p freq=noraman PBEPBE/SDD
converged: YES YES NO NO
title: Mulliken charges:
elementType: S O O N C C C C C C C C C C C C C C C C C H H H H H H H H H H H H H
charge: 0.268098 -0.405693 -0.248024 -0.053791 0.215444 0.299960 0.278084 -0.673676 -0.362910 -0.363718 -0.420599 -0.775936 0.512970 -0.246153 -0.239581 -0.383834 -0.359877 0.223749 -0.221532 -0.232045 -0.238591 0.260911 0.268914 0.264445 0.250309 0.346397 0.231125 0.229630 0.273016 0.231715 0.230210 0.229290 0.232033 0.379658
chargesum: 0.00000
title: Mulliken charges with hydrogens summed into heavy atoms:
elementType: S O O N C C C C C C C C C C C C C C C C C
charge: 0.268098 -0.026035 -0.248024 -0.053791 0.215444 0.299960 0.278084 -0.143851 -0.098465 -0.113409 -0.420599 -0.429539 0.512970 -0.015028 -0.009951 -0.110817 -0.128162 0.223749 0.008678 -0.002755 -0.006558
polarizability: 3.53750639e+02 -1.00129046e+01 2.30653438e+02 -2.04881359e+00 4.17129863e+00 1.01483724e+02
1716.lowfreq: -5.3899 -0.0010 0.0005 0.0008 3.1900 6.6099 23.3589 32.2123 52.3848
frequency: 23.3406 32.1270 52.3830 58.1596 79.6837 86.8511 101.9522 118.1876 140.9593 204.6809 216.0726 255.3682 289.1534 301.8210 318.6236 363.6980 399.0378 430.3232 444.8905 462.4332 480.1446 491.4756 531.2508 556.9415 590.8795 603.5266 615.7641 630.0649 651.5194 659.9133 685.6880 695.2712 706.0183 741.4689 773.6798 777.3451 791.2988 826.6682 851.4639 852.0207 868.0329 876.8805 892.7038 925.8767 933.7562 934.7302 965.6726 983.6480 987.9369 993.9224 1002.2311 1025.2706 1031.1918 1050.7854 1060.6409 1087.8249 1117.3414 1173.2456 1175.0577 1182.6747 1190.1879 1193.7002 1225.0048 1230.7364 1278.7207 1283.7742 1304.7870 1319.5139 1320.5750 1376.2890 1382.0953 1422.9090 1435.6027 1461.6022 1464.6417 1472.2273 1508.6970 1524.1662 1579.7407 1584.1795 1609.0994 1611.0300 1651.7808 3034.3877 3102.8187 3124.0395 3125.8366 3132.5190 3137.9465 3146.0354 3154.8637 3160.8843 3169.3600 3171.4831 3183.0342 3505.7152
redmass: 5.5581 4.4835 9.5023 6.2450 7.4515 5.4300 6.7239 5.3533 5.4034 5.7791 6.2851 5.7019 5.6573 7.5373 6.2666 6.1510 2.8264 3.6071 2.4835 3.7345 4.3029 3.7875 4.0482 4.3710 5.0241 7.7592 6.7419 1.8191 4.0475 5.9632 4.8650 1.8913 3.6631 3.7879 1.5165 1.8135 5.0670 4.1967 3.4145 1.2655 1.3791 4.6588 1.6425 6.7289 1.5669 1.7663 1.4113 1.3833 6.1120 1.3336 1.3315 2.4954 2.7915 2.3653 2.0905 1.6055 1.7473 1.0562 1.1071 1.2260 1.1198 2.1651 3.4170 1.5046 2.4082 1.4636 2.1096 2.1163 1.3405 6.9928 7.6620 2.2060 2.3806 1.2642 2.4670 2.1527 5.2168 6.2015 6.7747 6.1700 6.2814 6.0281 8.0793 1.0585 1.1040 1.0866 1.0862 1.0875 1.0900 1.0927 1.0948 1.0962 1.0995 1.1000 1.0988 1.0639
irintensity: 0.2418 0.3030 0.6651 0.4785 1.6469 0.1359 3.9098 0.9955 0.9629 1.3925 0.5476 0.6405 0.8690 1.5017 0.2238 0.5258 0.0139 3.6896 2.0687 7.3819 0.5891 20.1103 4.6663 66.7041 7.8662 3.7098 2.2109 93.0143 16.9503 48.9314 28.2207 35.3967 29.7867 13.0110 34.2990 83.7558 7.4680 3.0373 4.1245 0.2188 52.2377 4.5351 14.9460 40.2393 8.3722 19.8446 1.5214 0.2337 0.2119 0.7611 0.5960 14.0550 5.8842 12.8590 275.5688 16.5345 57.1800 0.2969 8.2046 9.9253 4.7404 1.9479 10.3456 10.5151 16.9370 1.1085 12.8957 85.0571 5.7135 2.5452 0.1497 16.1612 14.4618 27.5735 33.2803 41.7881 4.1756 14.9365 3.2079 0.2587 3.3188 1.4396 206.6524 14.4485 1.3247 7.0403 0.9777 1.3540 10.0161 20.9253 23.7278 22.5199 18.9425 23.7580 101.2795 32.7826
temp: 298.150 k
press: 1.00000 atm
elementType: 16 8 8 7 6 6 6 6 6 6 6 6 6 6 6 6 6 6 6 6 6 1 1 1 1 1 1 1 1 1 1 1 1 1
symmnumber: 1
zpe: 668362.9 jmol-1
zpe.correction: 0.254566 hartree
zpe.thermalcorrener: 0.272280 hartree
zpe.thermalcorrenthalpy: 0.273225 hartree
zpe.thermalcorrgfe: 0.206646 hartree
zpe.sumelectzpe: -1257.429619 hartree
zpe.sumelectthermal: -1257.411905 hartree
zpe.sumelectthermalent: -1257.410961 hartree
zpe.sumelectthermalfe: -1257.477539 hartree
dipole: -0.6894 0.4696 0.5975
dipole: 1.0261
quadrupole: -97.3926 -121.3129 -133.2959
quadrupole: 0.9128 -0.3581 -2.5129
quadrupole: 19.9412 -3.9791 -15.9621 0.9128 -0.3581 -2.5129
hfenergy: -1257.6841853 hartree
pointgroup: C01 [X(C17H13N1O2S1)]
dipole: 0.2762718 -0.0345167 0.2923173 debye
polarizability: 352.2723203|15.6157513|209.1968994|16.7460167|-47.4104686|124.4185807 unknown
InChI: InChI=1S/C17H13NO2S/c19-16(20)10-13-8-4-5-9-14(13)15-11-21-17(18-15)12-6-2-1-3-7-12/h1-9,11,19H,10H2
charge 0 multiplicity 1
34 atoms
S  -1.533994 1.71868 -1.249132
O  4.895576 2.58803 -0.251764
O  2.968793 2.779308 -1.524685
N  -0.864925 -0.453049 0.145238
C  1.618807 -0.451106 0.220905
C  2.795247 0.258627 0.614682
C  0.342852 0.192776 -0.185294
C  2.8521 1.785045 0.749922
C  1.647907 -1.875618 0.229101
C  3.963696 -0.471865 0.952763
C  -1.94272 0.172764 -0.302769
C  0.185751 1.359383 -0.933478
C  -3.33049 -0.256998 -0.091862
C  2.812508 -2.586568 0.571945
C  3.985902 -1.880581 0.926866
C  -3.580277 -1.415332 0.698905
C  -4.432091 0.445363 -0.652252
C  3.520042 2.430264 -0.454765
C  -4.900223 -1.854613 0.919129
C  -5.751463 0.002014 -0.427618
C  -5.992368 -1.149446 0.358313
H  3.437413 2.049024 1.645732
H  1.839154 2.207756 0.846416
H  0.730534 -2.407528 -0.040429
H  4.862328 0.083193 1.246643
H  0.959533 1.993695 -1.368602
H  2.807305 -3.681934 0.561493
H  4.901213 -2.420711 1.192317
H  -2.726004 -1.947105 1.12901
H  -4.259457 1.337621 -1.266315
H  -5.080435 -2.74613 1.529939
H  -6.591093 0.552455 -0.865775
H  -7.018203 -1.492604 0.531727
H  5.311276 2.967292 -1.073905
