program: Gaussian 09
title: 000184417
version: EM64L-G09RevD.01
frameworkgroup: C1[X(C17H14Br2O3)]
method: RPBEPBE
basis: SDD
operation: Freq
keyword: #p
keyword: freq=noraman
keyword: PBEPBE/SDD
title: #p freq=noraman PBEPBE/SDD
converged: YES YES NO NO
title: Mulliken charges:
elementType: Br Br O O O C C C C C C C C C C C C C C C C C H H H H H H H H H H H H H H
charge: 0.068670 0.017018 -0.204509 -0.411702 -0.233130 -0.617956 -0.675722 0.199477 0.192042 0.332520 0.571162 -0.582515 -0.332481 -0.357634 -0.399205 -0.344092 -0.269466 -0.239777 -0.223324 -0.227865 -0.234531 0.164818 0.325650 0.342383 0.285505 0.295418 0.259541 0.262514 0.241734 0.236462 0.240162 0.237839 0.233991 0.232694 0.234630 0.379681
chargesum: 0.00000
title: Mulliken charges with hydrogens summed into heavy atoms:
elementType: Br Br O O O C C C C C C C C C C C C C C C C C
charge: 0.068670 0.017018 -0.204509 -0.032021 -0.233130 -0.292306 -0.333339 0.199477 0.192042 0.332520 0.571162 -0.001592 -0.072940 -0.095120 -0.157471 -0.107631 -0.029305 -0.001938 0.010667 0.004829 0.000099 0.164818
polarizability: 2.56279900e+02 -3.54516718e+01 2.31466880e+02 -1.77856766e+01 -2.45658314e+01 1.88469757e+02
1716.lowfreq: -5.7433 -2.5403 -0.0006 -0.0004 0.0007 2.7531 8.7124 19.5277 28.0206
frequency: 8.3022 19.4649 27.9872 30.6312 39.6808 52.3547 65.8610 88.5043 101.8270 105.1406 128.3499 148.6385 160.2359 185.4847 210.0800 225.0019 234.9980 275.0778 319.3216 346.8432 399.7551 404.2590 416.6021 451.5756 485.0035 512.0598 527.2134 541.1214 562.3370 587.1689 616.7000 624.2518 633.3864 649.3352 681.1070 699.3606 707.8459 735.5787 771.3294 790.2172 800.4606 814.8330 824.6154 850.4129 869.9079 889.3658 927.6369 934.2521 958.8696 967.2891 978.1712 990.5125 999.3179 999.4640 1025.7479 1048.5608 1056.9486 1061.0360 1090.5432 1111.8119 1148.5613 1160.1028 1175.5108 1186.6321 1192.6384 1197.6312 1203.7135 1208.7694 1229.7446 1253.7937 1259.9207 1300.7684 1317.1252 1346.7982 1353.3793 1375.1537 1386.7288 1407.6563 1437.7024 1443.3812 1481.1848 1483.8906 1556.8917 1581.6980 1591.6721 1607.8722 1611.2596 1667.1686 3009.8896 3048.0723 3105.3106 3117.4003 3127.3694 3131.7361 3136.6346 3142.6748 3148.3987 3153.8287 3166.2698 3169.0587 3184.1297 3511.6815
redmass: 8.0878 6.4176 8.2050 9.2019 4.6483 3.9428 6.9027 7.7531 11.2648 8.7235 6.1368 9.6352 6.3469 5.9129 7.4514 4.2464 5.4860 8.3690 6.7513 5.3902 2.8004 4.6875 4.3670 2.8649 3.5683 2.6944 4.1053 5.6640 4.5072 5.3800 6.3956 5.4609 5.2040 1.4680 5.0922 1.8168 3.5437 1.7495 2.2459 2.4953 3.7630 4.8166 4.3098 1.2531 1.4861 4.1051 1.4566 2.2198 3.4851 1.7169 1.4289 5.6443 1.3335 1.3577 2.3322 2.5290 2.3477 3.2638 1.8283 2.0586 1.1468 1.3230 1.0663 1.1205 1.1406 1.5914 1.8019 1.1965 1.9265 1.8661 2.3736 1.4516 1.3861 1.5926 1.8891 3.0654 6.3918 1.3085 1.9204 2.1476 2.2425 2.4226 6.8287 7.5442 5.9553 5.9949 5.7293 8.3065 1.0630 1.0941 1.0867 1.0867 1.0857 1.0875 1.0859 1.0920 1.0908 1.0965 1.0976 1.1016 1.0958 1.0640
irintensity: 0.1797 0.5477 0.0475 1.4691 0.2372 0.1393 0.5885 0.7342 1.2402 0.4549 4.8393 3.6241 1.1908 0.3051 1.2705 1.3241 1.7021 0.6383 4.0856 9.9480 0.4006 4.1935 17.8776 18.2352 4.1040 3.4286 16.6454 53.5261 39.7915 77.7002 4.5474 15.9130 32.7377 142.0020 11.6604 50.8169 17.1647 22.5708 34.3135 33.2122 2.8137 3.4169 5.0084 0.2714 5.4073 5.4162 0.1572 5.9824 43.0966 8.2538 0.7091 2.0555 0.2136 0.7384 2.3939 310.0773 31.4155 11.8029 10.6319 11.8363 24.2257 13.2731 0.4276 0.8183 2.6205 1.8481 12.7685 1.8915 21.5101 22.8588 132.7418 1.7980 30.4338 28.1270 24.0242 26.9293 0.6394 14.2551 9.5221 11.6239 4.8307 46.5497 126.2175 34.8971 0.6350 0.8639 22.8204 176.9486 5.5276 3.1273 2.0389 1.0796 3.3356 0.0566 0.7874 10.1754 11.3082 24.9220 15.8244 19.3548 7.9380 30.7349
temp: 298.150 k
press: 1.00000 atm
elementType: 35 35 8 8 8 6 6 6 6 6 6 6 6 6 6 6 6 6 6 6 6 6 1 1 1 1 1 1 1 1 1 1 1 1 1 1
symmnumber: 1
zpe: 694369.7 jmol-1
zpe.correction: 0.264471 hartree
zpe.thermalcorrener: 0.285674 hartree
zpe.thermalcorrenthalpy: 0.286618 hartree
zpe.thermalcorrgfe: 0.208154 hartree
zpe.sumelectzpe: -907.242012 hartree
zpe.sumelectthermal: -907.220809 hartree
zpe.sumelectthermalent: -907.219865 hartree
zpe.sumelectthermalfe: -907.298330 hartree
dipole: -3.3294 0.7163 1.7303
dipole: 3.8200
quadrupole: -149.6774 -131.9280 -142.9479
quadrupole: -0.7560 3.1726 -9.7272
quadrupole: -8.1596 9.5897 -1.4301 -0.7560 3.1726 -9.7272
hfenergy: -907.5064832 hartree
pointgroup: C01 [X(C17H14Br2O3)]
dipole: -0.8581587 -1.0456688 -0.6548515 debye
polarizability: 210.4057487|27.083428|270.8353993|27.9642704|-15.1920354|194.9753892 unknown
InChI: InChI=1S/C17H14Br2O3/c18-15(11-6-2-1-3-7-11)16(19)17(22)13-9-5-4-8-12(13)10-14(20)21/h1-9,15-16,20H,10H2
charge 0 multiplicity 1
36 atoms
Br 0.914151 3.924811 0.521927
Br 4.097649 2.489636 -0.247561
O  0.01947 0.771182 1.646564
O  -2.725017 -3.029679 2.051111
O  -2.882103 -3.063236 -0.259503
C  1.189581 1.994338 -0.08856
C  2.497077 1.40517 0.461971
C  -1.202515 0.985353 -0.444947
C  -0.034629 1.21175 0.459882
C  -2.124032 -0.099678 -0.231272
C  2.674662 -0.052054 0.090576
C  -1.962138 -1.063571 0.936454
C  -1.415803 1.883028 -1.531883
C  -3.216224 -0.232067 -1.124598
C  2.93442 -0.996565 1.115889
C  2.566041 -0.50063 -1.25235
C  -2.517168 1.741398 -2.392864
C  -3.419932 0.674541 -2.186187
C  3.077494 -2.366954 0.806541
C  2.705064 -1.870181 -1.560316
C  2.960168 -2.808056 -0.53188
C  -2.57657 -2.443798 0.782843
H  1.205777 2.059917 -1.185154
H  2.549543 1.551024 1.550064
H  -2.357464 -0.61359 1.865765
H  -0.892595 -1.220156 1.172221
H  -0.741232 2.732732 -1.67592
H  -3.909403 -1.067007 -0.999887
H  3.014106 -0.656792 2.154699
H  2.402859 0.220974 -2.06139
H  -2.673968 2.454396 -3.208575
H  -4.281206 0.544478 -2.850467
H  3.278786 -3.08702 1.607039
H  2.62032 -2.206371 -2.599326
H  3.070816 -3.870986 -0.77274
H  -3.066181 -3.959036 1.941434
