program: Gaussian 09
title: 000184396
version: EM64L-G09RevD.01
frameworkgroup: C1[X(C20H21FO2)]
method: RPBEPBE
basis: SDD
operation: Freq
keyword: #p
keyword: freq=noraman
keyword: PBEPBE/SDD
title: #p freq=noraman PBEPBE/SDD
converged: YES YES NO NO
title: Mulliken charges:
elementType: F O O C C C C C C C C C C C C C C C C C C C C H H H H H H H H H H H H H H H H H H H H H
charge: -0.208954 -0.447433 -0.451121 0.065162 0.000394 -0.234412 0.459567 0.058812 0.228090 0.315751 0.322792 -0.484497 -0.541922 -0.422645 -0.415667 -0.475409 -0.737303 -0.439681 -0.749427 -0.566108 -0.354340 0.339329 -0.396957 0.221004 0.246109 0.218742 0.224438 0.209315 0.198637 0.209497 0.203692 0.223580 0.233978 0.250499 0.217999 0.233459 0.224820 0.236033 0.246073 0.311311 0.283309 0.340435 0.347783 0.255266
chargesum: 0.00000
title: Mulliken charges with hydrogens summed into heavy atoms:
elementType: F O O C C C C C C C C C C C C C C C C C C C C
charge: -0.208954 -0.106998 -0.103338 0.065162 0.000394 -0.234412 0.459567 0.058812 0.228090 0.315751 0.322792 -0.017384 -0.098741 -0.014693 -0.002478 -0.251829 -0.034827 -0.206223 -0.042501 -0.254797 -0.071031 0.339329 -0.141690
polarizability: 2.85162936e+02 8.53585625e-01 2.28487680e+02 -1.58863698e+00 -3.87213547e+00 1.36777122e+02
1716.lowfreq: -0.0012 -0.0004 -0.0002 2.9834 7.1839 13.4798 38.5834 54.9778 83.2479
frequency: 38.5748 54.9489 83.2390 95.7147 112.7171 132.9781 145.4984 179.6983 194.4923 209.9630 225.4095 240.9625 251.6336 265.3542 271.7411 291.3534 308.4062 315.1184 320.8269 332.5988 339.7710 364.8641 383.6185 386.0490 414.8113 430.4478 448.6910 455.0348 473.4351 501.2022 517.1405 558.4160 575.3178 583.9262 598.9932 617.2552 618.8923 646.9181 678.2732 718.6819 746.8565 763.0359 784.6590 815.4825 829.9860 835.2782 838.5067 858.7787 877.1497 889.5176 897.5895 899.4671 918.6170 924.2604 956.0527 961.4349 969.3420 1001.0046 1018.7612 1028.9625 1053.5316 1066.3099 1079.3648 1088.4081 1103.0682 1110.1296 1123.0072 1135.3596 1146.6877 1163.5864 1170.2390 1195.8057 1206.9500 1216.7781 1228.6416 1252.6632 1254.7304 1255.3983 1274.9339 1295.7937 1317.4136 1329.3506 1335.6050 1345.6485 1349.9789 1365.5052 1378.4159 1386.0535 1391.5619 1403.3803 1405.3130 1437.3322 1451.4207 1456.9733 1458.7369 1467.3721 1469.1550 1472.6262 1476.2570 1478.1598 1487.0454 1579.1052 1598.9526 1607.0521 1617.2214 2954.6899 2973.2134 2974.4236 2978.1527 2984.9132 3002.3224 3015.4594 3039.1962 3046.0480 3070.2672 3090.1975 3095.6930 3102.4113 3110.4432 3111.7530 3145.2177 3164.3393 3175.4123 3183.6742 3542.3633 3569.3746
redmass: 4.8405 3.8641 4.5677 3.1313 2.4696 5.1268 4.3195 1.8037 1.4712 3.2277 3.6498 2.3246 2.8867 1.1713 2.4139 3.9159 3.8001 1.8213 3.2686 2.8347 2.7652 1.8856 3.7088 2.6578 3.4128 3.6630 3.7578 3.7125 3.8458 3.5477 3.5733 4.7727 3.5664 3.9240 3.5070 4.6971 4.1133 4.7058 4.4750 4.9577 3.6897 3.2498 3.8988 1.6541 1.4907 1.7360 2.9120 2.9777 2.6560 2.4819 1.4864 1.6020 2.2992 2.6283 1.3817 1.3800 2.5404 2.7168 2.6775 2.0955 2.7933 1.7436 1.9258 2.0373 1.7644 1.8948 1.6217 1.1625 1.8519 1.6631 1.8323 1.4981 2.8759 3.2664 1.6435 1.7138 1.4978 2.1009 1.2972 1.6440 1.7121 2.2494 1.6799 1.4494 2.5456 1.9130 1.2406 1.3120 7.2867 3.3262 3.8089 1.2274 1.2044 1.0851 1.1067 1.1158 1.2083 1.0884 1.2279 1.3381 2.6256 7.0082 7.1907 7.8482 7.8219 1.0642 1.0369 1.0661 1.0628 1.0693 1.0350 1.0942 1.0976 1.1033 1.0983 1.0889 1.0995 1.0995 1.0995 1.0876 1.0947 1.0884 1.0918 1.0970 1.0657 1.0661
irintensity: 0.0181 0.4602 0.4055 0.2336 0.6431 0.4118 0.7121 4.6627 0.9463 2.0228 14.3743 32.8156 20.6858 20.2361 15.1228 4.5539 0.4062 19.7942 4.0407 6.6271 20.1384 64.7691 1.9089 121.6718 2.9544 6.1289 7.4191 4.4453 0.8945 3.4350 9.3562 1.4625 16.0655 11.5263 6.5926 10.3457 0.3190 6.3688 4.4344 12.7674 1.1008 2.6904 2.6134 15.9933 42.6616 10.4269 1.7556 34.1716 4.5933 8.5102 21.7674 29.6152 15.3767 27.6223 0.6519 3.4722 7.7736 21.0211 15.4713 2.2299 49.3209 27.1846 9.9666 18.2715 10.5568 7.6127 38.4376 0.9298 6.7077 14.5784 22.0059 0.8932 1.9502 39.2354 7.6423 54.5010 7.4801 26.0054 4.1436 49.6091 13.7344 50.1290 6.7086 1.4510 1.3380 3.6262 3.7034 30.0812 1.7155 9.1698 10.7195 1.9676 20.3447 14.5033 0.7231 11.4724 11.6003 10.8563 25.7319 15.6997 64.5533 6.7537 11.0136 9.2201 32.5905 27.8297 23.6741 32.5324 34.5645 19.8740 16.4235 38.0343 75.2396 62.6450 28.7605 19.3267 23.0610 14.8591 27.0118 14.5511 25.2220 1.4152 1.4708 6.7049 7.5265 10.2250
temp: 298.150 k
press: 1.00000 atm
elementType: 9 8 8 6 6 6 6 6 6 6 6 6 6 6 6 6 6 6 6 6 6 6 6 1 1 1 1 1 1 1 1 1 1 1 1 1 1 1 1 1 1 1 1 1
symmnumber: 1
zpe: 939154.1 jmol-1
zpe.correction: 0.357705 hartree
zpe.thermalcorrener: 0.378142 hartree
zpe.thermalcorrenthalpy: 0.379086 hartree
zpe.thermalcorrgfe: 0.310841 hartree
zpe.sumelectzpe: -1023.361249 hartree
zpe.sumelectthermal: -1023.340813 hartree
zpe.sumelectthermalent: -1023.339868 hartree
zpe.sumelectthermalfe: -1023.408113 hartree
dipole: -3.0111 2.6042 1.6035
dipole: 4.2918
quadrupole: -136.2223 -129.7610 -135.0964
quadrupole: 7.9829 4.3637 4.1242
quadrupole: -2.5291 3.9323 -1.4032 7.9829 4.3637 4.1242
hfenergy: -1023.7189544 hartree
pointgroup: C01 [X(C20H21F1O2)]
dipole: 1.2065463 0.995916 -0.6352568 debye
polarizability: 285.0835252|-2.1643758|228.5676815|-1.8857167|3.8007181|136.7765317 unknown
InChI: InChI=1S/C20H21FO2/c1-19(22)15-10-8-13(21)11-17(15)20(2,23)18-14-6-4-3-5-12(14)7-9-16(18)19/h7-11,22-23H,3-6H2,1-2H3
charge 0 multiplicity 1
44 atoms
F  -5.009233 -2.126008 0.673684
O  -0.071781 -2.321598 0.298185
O  -1.361324 3.021226 0.577893
C  0.786472 -0.005505 -0.114327
C  -0.306362 -1.052319 -0.444323
C  -1.016397 1.863633 -0.286794
C  0.412424 1.36407 -0.002662
C  2.169498 -0.387112 0.037789
C  -1.723029 -0.572746 -0.079246
C  -2.061457 0.797198 0.012763
C  3.139048 0.615946 0.338452
C  2.649152 -1.840878 -0.092613
C  4.634627 0.323845 0.482079
C  4.154686 -1.971539 -0.406405
C  4.980269 -1.170827 0.617292
C  1.390776 2.333491 0.315442
C  -0.277253 -1.474439 -1.93697
C  2.729801 1.962045 0.48954
C  -1.12467 2.328404 -1.770247
C  -2.722442 -1.555471 0.140867
C  -3.384233 1.178339 0.347841
C  -4.021329 -1.140561 0.455643
C  -4.384216 0.212434 0.574028
H  2.446744 -2.371578 0.858843
H  2.056642 -2.387401 -0.840699
H  5.151081 0.727961 -0.414254
H  5.032771 0.894291 1.343673
H  4.434991 -3.041817 -0.387603
H  4.36886 -1.596362 -1.428082
H  6.065892 -1.322897 0.468254
H  4.737296 -1.529522 1.637667
H  1.100312 3.379512 0.455648
H  0.733154 -1.785766 -2.245659
H  -0.972279 -2.317957 -2.089487
H  -0.594932 -0.638952 -2.582493
H  3.479101 2.722333 0.743618
H  -0.385771 3.127062 -1.976725
H  -0.918653 1.499852 -2.46835
H  -2.142023 2.708929 -1.971429
H  -2.474717 -2.618256 0.081117
H  -3.607897 2.242395 0.456576
H  -0.116845 -2.115198 1.267672
H  -0.995198 3.844618 0.167644
H  -5.408356 0.488928 0.840062
