program: Gaussian 09
title: 000184381
version: EM64L-G09RevD.01
frameworkgroup: C1[X(C18H13FO2)]
method: RPBEPBE
basis: SDD
operation: Freq
keyword: #p
keyword: freq=noraman
keyword: PBEPBE/SDD
title: #p freq=noraman PBEPBE/SDD
converged: YES YES NO NO
title: Mulliken charges:
elementType: F O O C C C C C C C C C C C C C C C C C C H H H H H H H H H H H H H
charge: -0.188672 -0.203090 -0.193038 0.165188 -0.482148 -0.423202 -0.414077 0.095273 -0.512108 0.142940 0.310659 0.220393 -0.218492 -0.631726 -0.238566 0.292356 0.266542 -0.384209 -0.372595 -0.228667 -0.228025 0.244342 0.261199 0.217373 0.204042 0.215368 0.210302 0.237228 0.253346 0.316230 0.292685 0.291433 0.240404 0.241315
chargesum: 0.00000
title: Mulliken charges with hydrogens summed into heavy atoms:
elementType: F O O C C C C C C C C C C C C C C C C C C
charge: -0.188672 -0.203090 -0.193038 0.165188 0.023393 -0.001787 0.011592 0.095273 -0.021534 0.142940 0.310659 0.220393 -0.218492 -0.315496 -0.238566 0.292356 0.266542 -0.091525 -0.081163 0.011737 0.013290
polarizability: 3.17240980e+02 -3.45818415e+00 2.22506772e+02 7.05024944e-01 1.40276212e+00 9.07086114e+01
1716.lowfreq: 0.0001 0.0006 0.0007 5.1072 9.1809 11.5244 35.6524 47.9317 98.0783
frequency: 35.6077 47.8629 98.0688 113.0296 123.0775 149.3793 168.9785 200.3692 247.8718 273.2237 281.3544 287.5641 310.3283 338.6165 340.3142 384.0553 424.6331 433.6856 444.6296 457.3372 470.2330 495.5206 527.8506 539.1772 582.4159 604.8790 630.8292 671.1336 680.7332 712.1223 721.7721 726.5681 733.2108 808.2844 827.4858 850.4204 861.6533 867.9256 884.3974 902.0026 920.8854 947.3929 962.7053 992.0430 999.0807 1016.1736 1019.0986 1039.3090 1060.3816 1083.7659 1096.3886 1108.0750 1138.0554 1156.7628 1169.4831 1173.4645 1192.9753 1226.8960 1236.1602 1249.7131 1265.4077 1281.1106 1308.0717 1328.4039 1336.1830 1346.1396 1358.2004 1377.8486 1396.6694 1402.6821 1418.2895 1439.6615 1443.6889 1460.6322 1470.9562 1472.5415 1475.2929 1529.3863 1540.3132 1570.3945 1590.7832 1601.7795 1612.8276 2971.2517 2979.4728 2986.9456 2988.2259 3038.5846 3047.7363 3052.2497 3058.5342 3137.0532 3152.4540 3164.0174 3172.6995 3176.9349
redmass: 6.2364 5.6937 3.0093 3.4439 5.1730 5.3929 4.8224 5.8126 7.4928 4.2379 3.4775 3.6690 3.4414 3.5590 7.9010 11.4981 3.4363 3.7407 4.7844 6.8821 5.6983 4.4981 3.2011 4.6866 5.9110 4.9796 4.8134 5.4915 4.1191 7.3157 3.6426 3.7863 2.6159 1.7521 1.8052 5.4225 2.5200 2.7892 2.6122 1.6191 1.4320 2.1505 3.5907 3.9712 1.3977 1.3761 4.0508 2.0201 4.0575 1.9319 2.0509 1.6578 1.1653 1.5258 1.2886 1.2784 2.6520 2.3105 2.7312 1.2654 1.2751 1.9662 3.3619 2.0856 1.6773 1.4255 1.9351 3.2594 3.7977 8.9373 2.1023 1.8221 1.5914 1.6354 2.6869 1.0907 1.0938 9.7276 9.2896 8.3806 7.4191 8.8696 7.2945 1.0666 1.0669 1.0616 1.0670 1.0931 1.0949 1.0970 1.0992 1.0864 1.0904 1.0946 1.1000 1.0929
irintensity: 3.9973 0.1008 0.0724 2.1012 0.5759 1.4281 0.4130 0.3242 0.5417 3.3515 3.7479 0.9256 0.4798 0.4766 2.0081 22.4472 2.0273 0.5987 0.1305 0.9195 1.9421 0.7016 3.3186 1.8987 1.1988 9.1300 18.1006 3.8067 1.0009 5.5810 13.5360 25.5072 43.8428 28.0702 5.3020 1.0497 4.6574 5.2545 2.1961 4.8176 15.9542 6.8047 45.9895 31.9060 4.7218 0.0930 14.0489 3.9437 3.0930 0.1541 11.2408 7.8048 0.2302 1.1529 7.6120 9.1260 9.8527 1.0268 15.9929 7.3407 1.0146 67.8249 649.3759 51.1042 70.3103 3.8715 15.9907 5.5891 4.1421 0.8909 7.0869 24.0386 4.0466 2.4727 10.5609 11.1444 9.3431 21.4761 335.6746 7.0185 5.2780 0.7783 4.7050 10.9281 29.8594 39.8701 18.3498 18.7732 48.2204 31.1102 38.0123 3.9906 6.6268 1.7164 32.1242 5.2857
temp: 298.150 k
press: 1.00000 atm
elementType: 9 8 8 6 6 6 6 6 6 6 6 6 6 6 6 6 6 6 6 6 6 1 1 1 1 1 1 1 1 1 1 1 1 1
symmnumber: 1
zpe: 681876.4 jmol-1
zpe.correction: 0.259713 hartree
zpe.thermalcorrener: 0.275769 hartree
zpe.thermalcorrenthalpy: 0.276713 hartree
zpe.thermalcorrgfe: 0.216223 hartree
zpe.sumelectzpe: -942.593139 hartree
zpe.sumelectthermal: -942.577083 hartree
zpe.sumelectthermalent: -942.576139 hartree
zpe.sumelectthermalfe: -942.636628 hartree
dipole: 0.0269 -2.3747 0.3102
dipole: 2.3951
quadrupole: -95.4863 -132.2474 -121.3223
quadrupole: 0.4246 0.1784 -0.7855
quadrupole: 20.8657 -15.8954 -4.9703 0.4246 0.1784 -0.7855
hfenergy: -942.8528515 hartree
pointgroup: C01 [X(C18H13F1O2)]
dipole: 0.0250311 -0.9343004 0.1198714 debye
polarizability: 317.3233612|-1.9785073|222.4143647|1.028517|1.7207357|90.7186377 unknown
InChI: InChI=1S/C18H13FO2/c19-15-9-14-16(11-6-2-1-5-10(11)15)18(21)13-8-4-3-7-12(13)17(14)20/h3-4,7-9H,1-2,5-6H2
charge 0 multiplicity 1
34 atoms
F  -3.292015 2.72621 0.021071
O  0.550624 -2.513141 -0.186933
O  1.726934 2.863609 0.049526
C  -1.711361 -0.632944 0.047469
C  -2.143376 -2.09578 0.10894
C  -3.630121 -2.307808 0.46474
C  -4.533326 -1.367444 -0.353535
C  -2.716692 0.382398 0.033543
C  -4.210832 0.091797 0.017767
C  -0.322205 -0.248054 0.010876
C  0.035225 1.141825 0.021509
C  -2.293694 1.728851 0.027095
C  0.775113 -1.264007 -0.059682
C  -0.962993 2.138431 0.031345
C  1.456058 1.620161 0.034936
C  2.199295 -0.789084 -0.00258
C  2.531299 0.592897 0.041797
C  3.237157 -1.753824 -0.005875
C  3.888552 0.99791 0.082875
C  4.585787 -1.347589 0.039878
C  4.913585 0.032048 0.084232
H  -1.915098 -2.570148 -0.866257
H  -1.497102 -2.637962 0.820027
H  -3.891988 -3.366614 0.283809
H  -3.792235 -2.116208 1.54486
H  -5.60233 -1.572316 -0.160113
H  -4.358024 -1.533589 -1.434942
H  -4.624665 0.316431 1.022532
H  -4.708344 0.79869 -0.671156
H  -0.677329 3.193529 0.03713
H  2.958476 -2.811074 -0.047127
H  4.107397 2.069876 0.112136
H  5.383121 -2.098435 0.039802
H  5.962605 0.344757 0.117905
