program: Gaussian 09
title: 000184376
version: EM64L-G09RevD.01
frameworkgroup: C1[X(C10H10BrN2)]
method: RPBEPBE
basis: SDD
operation: Freq
keyword: #p
keyword: freq=noraman
keyword: PBEPBE/SDD
title: #p freq=noraman PBEPBE/SDD
converged: YES YES NO NO
title: Mulliken charges:
elementType: Br N N C C C C C C C C C C H H H H H H H H H H
charge: 0.202844 0.016149 0.135641 -0.412704 -0.420202 -0.529001 -0.543174 0.150370 0.453300 0.270744 -0.445688 -0.368342 -0.135077 0.230701 0.252776 0.225423 0.255083 0.246070 0.269986 0.275704 0.274697 0.295991 0.298711
chargesum: 1.00000
title: Mulliken charges with hydrogens summed into heavy atoms:
elementType: Br N N C C C C C C C C C C
charge: 0.202844 0.016149 0.135641 0.070773 0.060304 -0.012945 0.007227 0.150370 0.453300 0.270744 -0.445688 -0.072352 0.163633
polarizability: 2.35642685e+02 -1.91471854e+01 1.42621365e+02 -8.56871770e-01 6.99120172e-02 6.49942660e+01
1716.lowfreq: -6.9613 -0.0003 -0.0002 0.0002 3.1013 9.1185 69.3907 87.4875 98.1955
frequency: 69.3900 87.4806 98.1914 131.5403 166.5811 229.9449 260.8240 265.3439 294.0591 356.8302 418.0357 432.1939 459.2867 499.6360 521.2668 563.4250 574.9552 617.5903 636.4701 706.5802 802.9033 812.5530 827.8374 860.8798 894.4034 905.5593 968.5511 975.2585 1019.2296 1081.3160 1100.6453 1135.7941 1143.6114 1174.9367 1183.4889 1190.2631 1205.9225 1252.4839 1273.6135 1322.7768 1332.6919 1353.0205 1359.0615 1373.7288 1400.3744 1406.6073 1438.5190 1460.9679 1475.9952 1476.7095 1512.3663 1558.9797 2082.6850 2956.9735 2977.6449 2999.5704 3004.6896 3020.1802 3042.0885 3075.1905 3080.5883 3173.5408 3191.1788
redmass: 7.7776 2.8312 2.4837 9.5354 6.6467 5.1661 7.0961 3.7512 1.7794 5.5406 4.1497 3.6832 5.1361 3.4611 3.3568 5.3073 5.3121 4.0027 5.0660 3.6552 3.1055 1.4198 1.6473 3.2852 1.6590 2.4810 1.3416 3.1626 2.8454 1.9389 2.4766 2.1245 1.2008 1.2663 2.3970 1.5945 4.6971 1.2556 1.1714 1.4909 1.4736 1.4176 2.0763 2.5254 2.1460 2.0660 1.0829 1.6365 1.0939 1.0847 6.3509 5.9738 13.8785 1.0621 1.0653 1.0687 1.0716 1.0857 1.0939 1.0976 1.1031 1.0900 1.0999
irintensity: 0.3776 0.0300 0.1041 0.2578 0.6047 0.4401 9.1019 10.3389 0.2028 0.0432 0.2366 0.5701 0.0352 0.3396 1.0067 4.9444 5.6088 3.5054 2.8158 1.7353 25.6186 38.5712 13.0877 9.2181 13.9126 15.4283 0.0701 3.6548 0.0962 0.1973 47.7175 41.8051 1.9443 40.1544 10.5898 4.6226 98.1928 0.9129 4.0401 0.8470 17.4244 1.6892 7.7033 5.8676 30.7506 36.4048 15.3952 37.8779 16.3378 9.7202 2.4998 304.9191 466.1255 9.4143 5.0225 14.4653 11.0008 22.1117 4.5045 18.3651 20.4489 2.9006 4.6221
temp: 298.150 k
press: 1.00000 atm
elementType: 35 7 7 6 6 6 6 6 6 6 6 6 6 1 1 1 1 1 1 1 1 1 1
symmnumber: 1
zpe: 468188.5 jmol-1
zpe.correction: 0.178324 hartree
zpe.thermalcorrener: 0.189784 hartree
zpe.thermalcorrenthalpy: 0.190728 hartree
zpe.thermalcorrgfe: 0.139813 hartree
zpe.sumelectzpe: -508.809788 hartree
zpe.sumelectthermal: -508.798328 hartree
zpe.sumelectthermalent: -508.797384 hartree
zpe.sumelectthermalfe: -508.848299 hartree
dipole: 5.3875 -2.0290 -0.0863
dipole: 5.7575
quadrupole: -54.3629 -56.4823 -82.5438
quadrupole: -3.9471 -0.2246 0.0982
quadrupole: 10.1001 7.9807 -18.0808 -3.9471 -0.2246 0.0982
hfenergy: -508.988112 hartree
pointgroup: C01 [X(C10H10Br1N2)]
dipole: -2.2331368 0.3726081 0.0727762 debye
dipolederiv: -0.6513437 0.313698 0.0265632 0.2469544 -0.0375201 -0.0047436 0.0253254 -0.0148121 0.1163057 2.2488214 -0.4959319 -0.0496195 -0.7126802 0.1513892 0.0130201 -0.0440474 0.0070266 0.1766557 -1.1587428 0.2918275 0.0287282 0.4049762 -0.0094661 -0.0069566 0.0273439 -0.0031516 0.0655494 0.0600881 0.1063489 -0.0283729 -0.0006185 0.1121285 0.0142984 -0.0286066 -0.02002 0.123116 0.030838 -0.0283778 -0.0225522 0.0234131 0.0919638 -0.0013372 -0.0097364 0.0414267 0.1321968 -0.0131758 0.1249266 0.0239019 -0.0304399 -0.1393045 -0.0022258 -0.0025653 -0.1327023 0.1042216 -0.1048528 -0.0995661 -0.0014365 -0.0115219 0.0629402 0.0022527 0.0262914 0.0715934 0.0848507 0.5753104 -0.65444 -0.0174025 0.2228736 0.3968333 0.0169735 0.0114925 0.0903125 0.011245 -0.2483336 0.8811544 0.0265029 0.613879 -0.4970337 -0.0364332 0.0049623 -0.0732713 0.0534881 -1.1273645 0.2815503 0.0193671 0.4722296 -0.0065965 -0.0027815 0.0168723 -0.0079294 0.0639865 1.4640321 -0.5705493 -0.0712432 -0.4597075 0.5490785 0.0283995 -0.0712604 0.0290769 -0.118433 0.4247183 -0.0056125 -0.0060784 -0.5985037 0.0577611 0.0155425 -0.0226527 -0.0046298 -0.0759835 -0.8347172 -0.1049996 0.0194179 -0.1156214 0.0157834 -0.0036603 0.0210116 0.0076519 -0.031959 0.0276683 -0.0438306 0.0304582 -0.0037959 0.0969698 -0.0518023 0.0120183 0.0096198 -0.1247944 0.0519486 0.0580575 0.0071873 0.0421682 -0.1214356 -0.0129538 0.0144399 -0.0329192 0.0925938 0.0682676 0.0640349 0.05933 0.0219613 0.0612069 0.0149402 0.0052385 -0.0273368 -0.1323114 -0.0414975 -0.1059447 0.0155456 -0.0867162 -0.0176212 0.0111999 0.0309751 0.031613 0.0913107 -0.0725855 -0.0341917 -0.0887434 -0.0502784 0.0323176 -0.0186859 -0.0753464 0.0200118 0.0484183 0.0675502 0.0031843 0.0402317 -0.0041507 0.0238587 -0.004536 0.0606905 0.0348166 -0.0421265 0.0333102 0.0331994 -0.0561159 0.0457289 -0.0054827 0.0506486 -0.052138 0.0328162 0.0506163 0.0663151 -0.0204517 0.0401009 -0.0351155 0.022835 -0.0185647 0.0416143 -0.0547631 -0.0366167 0.0504418 -0.0172213 0.0024731 0.0154167 0.0919957 -0.0007878 0.0019332 -0.0025603 0.1850133 0.0833034 0.0231352 0.0017567 -0.0004512 0.0673986 -0.0018067 0.006144 -0.0018696 0.1626565 unknown
polarizability: 228.7688284|-30.8313442|149.3981305|-3.6675501|1.921285|65.0913573 unknown
InChI: InChI=1S/C10H10BrN2/c11-9-5-6-10(13-12)8-4-2-1-3-7(8)9/h5-6H,1-4H2
charge 1 multiplicity 1
23 atoms
Br 3.083064 -2.075049 -0.117994
N  -2.670389 -0.20537 0.048109
N  -3.78177 0.131694 0.074661
C  0.445302 2.818643 -0.394025
C  1.723767 2.428444 0.370663
C  -0.719073 1.891192 0.017428
C  2.157766 0.99108 0.01658
C  -0.335632 0.419329 0.013295
C  1.015958 -0.015012 0.002085
C  -1.357301 -0.600163 0.02065
C  1.270928 -1.42347 -0.037145
C  -1.092871 -2.006354 0.003712
C  0.240742 -2.406081 -0.031559
H  0.619385 2.745652 -1.484447
H  0.164856 3.864133 -0.179907
H  1.546365 2.5143 1.460248
H  2.546252 3.122464 0.127009
H  -1.588806 2.061849 -0.647688
H  -1.051773 2.16388 1.041977
H  2.934165 0.643314 0.722857
H  2.639566 0.976452 -0.982746
H  -1.907697 -2.735314 0.012154
H  0.493696 -3.468814 -0.054816
