program: Gaussian 09
title: 000184344
version: EM64L-G09RevD.01
frameworkgroup: C1[X(C17H11BrO2)]
method: RPBEPBE
basis: SDD
operation: Freq
keyword: #p
keyword: freq=noraman
keyword: PBEPBE/SDD
title: #p freq=noraman PBEPBE/SDD
converged: YES YES NO NO
title: Mulliken charges:
elementType: Br O O C C C C C C C C C C C C C C C C C H H H H H H H H H H H
charge: 0.072842 -0.192005 -0.167126 0.554905 -0.748236 0.291319 0.254133 -0.126341 0.472132 -0.661116 0.110799 -0.368729 -0.354830 -0.384636 -0.374615 -0.225051 -0.222021 -0.231222 -0.233747 -0.239113 0.250355 0.264734 0.289410 0.290820 0.236041 0.271073 0.243822 0.244452 0.226927 0.226159 0.228865
chargesum: 0.00000
title: Mulliken charges with hydrogens summed into heavy atoms:
elementType: Br O O C C C C C C C C C C C C C C C C C
charge: 0.072842 -0.192005 -0.167126 0.554905 -0.233148 0.291319 0.254133 -0.126341 0.472132 -0.661116 0.110799 -0.079319 -0.064010 -0.148595 -0.103542 0.018771 0.022431 -0.004295 -0.007588 -0.010248
polarizability: 2.61189829e+02 -1.51664536e+01 2.45451571e+02 -6.09453144e+00 -1.64949592e+01 1.22806370e+02
1716.lowfreq: -1.5761 -0.0004 0.0003 0.0005 3.8885 8.4773 15.7973 33.5502 46.7822
frequency: 15.1402 33.5340 46.7756 61.6527 91.5857 126.0446 157.7565 165.5846 191.0919 209.3688 245.0260 282.2190 293.4351 372.7658 389.1345 402.5443 405.5168 419.9519 430.2731 466.6509 492.1667 503.1537 556.8019 602.9481 616.9379 648.0115 665.9287 696.5835 704.5441 721.2498 748.9519 764.5596 793.5651 811.9033 816.2620 849.0044 857.2590 926.5641 929.1406 943.5783 956.0396 982.9502 989.8678 996.8285 998.0448 1014.8155 1026.7257 1028.8236 1068.4473 1086.3849 1094.6622 1141.1890 1172.5553 1173.7369 1189.7582 1192.7375 1207.3727 1248.6510 1272.5318 1294.7330 1300.1482 1332.6279 1381.9990 1403.1031 1439.3798 1440.4483 1457.1252 1472.6159 1481.4582 1535.5817 1552.7088 1565.8616 1591.6420 1599.4035 1606.1747 1608.6644 3023.2907 3088.4359 3123.5090 3131.0783 3140.8824 3143.3327 3151.2254 3154.9818 3164.9045 3165.5566 3175.1027
redmass: 4.9790 6.2293 8.5557 6.1959 6.2898 5.5319 8.4121 7.4740 5.8341 5.3910 9.4743 7.0004 7.5422 6.2099 3.6198 3.2313 2.9830 3.9361 4.5559 8.2047 5.0293 4.8729 6.4651 5.1310 6.2881 5.7374 5.8936 4.3758 2.0865 2.6393 3.1875 3.0429 1.9718 3.9907 3.1311 3.3649 1.2752 1.5156 1.7219 2.7631 3.1793 1.3763 6.2614 1.3931 1.3175 1.3662 2.4913 2.3604 2.6404 1.8839 2.4355 1.9452 1.0554 1.0752 1.5414 1.7490 1.6059 1.9949 2.8455 2.8016 1.3656 1.2629 7.7755 10.2357 2.3944 2.1722 1.1638 2.6422 2.0918 9.3531 10.5008 9.4773 6.0300 8.0373 6.7452 6.1205 1.0589 1.1025 1.0845 1.0878 1.0865 1.0924 1.0964 1.0903 1.1016 1.0948 1.1005
irintensity: 0.4208 0.7789 2.4897 0.1956 2.5838 0.2752 0.7280 1.3397 1.2975 1.3216 0.8615 0.2151 0.2630 10.5442 0.3346 5.2601 1.5115 0.9429 2.8769 13.2731 4.1210 5.4293 15.7837 23.6120 0.4458 11.2963 0.0876 6.3816 36.5386 85.6858 40.2824 49.0904 20.4202 23.6160 11.6515 1.8945 0.6759 1.7428 0.4983 26.5474 5.7549 0.7881 0.1873 2.8156 0.8057 0.0157 16.5993 2.1648 43.3813 9.4330 25.0068 39.9240 0.2589 7.6650 10.3782 0.8082 6.1084 74.3409 215.4136 153.2721 16.5301 1.4804 1.1273 0.0171 4.4463 7.9065 26.6887 3.5082 38.3410 44.7114 222.5801 136.8068 3.3747 15.3360 3.1949 4.3007 11.3402 1.2675 0.9799 4.4986 3.4900 17.8024 22.7259 4.3127 25.3772 1.0509 25.0862
temp: 298.150 k
press: 1.00000 atm
elementType: 35 8 8 6 6 6 6 6 6 6 6 6 6 6 6 6 6 6 6 6 1 1 1 1 1 1 1 1 1 1 1
symmnumber: 1
zpe: 597075.7 jmol-1
zpe.correction: 0.227414 hartree
zpe.thermalcorrener: 0.243775 hartree
zpe.thermalcorrenthalpy: 0.244719 hartree
zpe.thermalcorrgfe: 0.180664 hartree
zpe.sumelectzpe: -816.950976 hartree
zpe.sumelectthermal: -816.934615 hartree
zpe.sumelectthermalent: -816.933671 hartree
zpe.sumelectthermalfe: -816.997725 hartree
dipole: 1.6107 -2.2602 -0.4184
dipole: 2.8067
quadrupole: -102.9072 -126.1723 -125.5297
quadrupole: -11.7836 0.5261 6.4608
quadrupole: 15.2959 -7.9693 -7.3266 -11.7836 0.5261 6.4608
hfenergy: -817.1783898 hartree
pointgroup: C01 [X(C17H11Br1O2)]
dipole: 0.5502171 0.9264545 0.2415177 debye
polarizability: 258.294327|15.6803615|250.0524199|9.1247761|-5.5046022|121.1010238 unknown
InChI: InChI=1S/C17H11BrO2/c18-15-14(10-11-6-2-1-3-7-11)16(19)12-8-4-5-9-13(12)17(15)20/h1-9H,10H2
charge 0 multiplicity 1
31 atoms
Br -0.574426 -3.325611 -0.531405
O  0.121655 1.883082 -1.416447
O  2.203776 -2.775134 0.591188
C  -0.208777 -0.456124 -0.950641
C  -1.600806 -0.345396 -1.550816
C  1.942394 0.805026 -0.264707
C  2.482611 -0.40295 0.251897
C  0.595439 0.819927 -0.902895
C  -2.651795 0.060666 -0.503951
C  0.356473 -1.61225 -0.460485
C  1.719971 -1.687305 0.161173
C  2.687453 2.005502 -0.174565
C  3.763839 -0.404106 0.853152
C  -3.497321 -0.913433 0.086343
C  -2.80019 1.419403 -0.121651
C  3.962269 2.001364 0.428738
C  4.500864 0.795432 0.943011
C  -4.467457 -0.538897 1.043815
C  -3.770563 1.793592 0.834313
C  -4.605817 0.815763 1.423342
H  -1.881551 -1.309379 -2.006074
H  -1.56308 0.424608 -2.340966
H  2.249805 2.922087 -0.582008
H  4.15796 -1.349368 1.238826
H  -3.39897 -1.964898 -0.206048
H  -2.155935 2.177269 -0.580922
H  4.536915 2.930697 0.49951
H  5.491185 0.794198 1.410187
H  -5.115421 -1.302716 1.488437
H  -3.877264 2.847315 1.115954
H  -5.358137 1.106433 2.165195
