program: Gaussian 09
title: 000184320
version: EM64L-G09RevD.01
frameworkgroup: C1[X(C12H2BrCl7)]
method: RPBEPBE
basis: SDD
operation: Freq
keyword: #p
keyword: freq=noraman
keyword: PBEPBE/SDD
title: #p freq=noraman PBEPBE/SDD
converged: NO YES NO NO
title: Mulliken charges:
elementType: Br Cl Cl Cl Cl Cl Cl Cl C C C C C C C C C C C C H H
charge: 0.081030 0.048754 0.048746 0.028853 0.062854 0.062853 0.071022 0.045840 0.582071 0.401813 -0.322028 -0.322080 -0.247150 -0.337688 -0.084853 -0.084842 -0.109533 -0.037150 -0.190568 -0.221978 0.261097 0.262937
chargesum: 0.00000
title: Mulliken charges with hydrogens summed into heavy atoms:
elementType: Br Cl Cl Cl Cl Cl Cl Cl C C C C C C C C C C C C
charge: 0.081030 0.048754 0.048746 0.028853 0.062854 0.062853 0.071022 0.045840 0.582071 0.401813 -0.322028 -0.322080 -0.247150 -0.076591 -0.084853 -0.084842 -0.109533 -0.037150 0.072368 -0.221978
polarizability: 3.22318460e+02 3.32252874e-03 1.87466544e+02 -8.93521833e+00 -1.79715363e-02 1.47873510e+02
1716.lowfreq: 0.0018 0.0021 0.0023 2.2337 2.4459 5.6049 15.7018 27.7961 30.3978
frequency: 15.6040 27.7782 30.3978 65.1729 72.0109 74.6874 96.1875 120.2168 128.5080 160.2651 188.2237 204.2542 204.5096 206.8662 216.6924 220.1269 237.7202 287.7536 306.5952 326.5395 328.7969 329.5309 337.4358 356.2465 427.3141 467.0365 488.5306 511.3469 538.3282 599.4232 611.0080 618.1022 640.4952 656.3078 728.1668 744.1190 747.3356 783.7298 816.2821 823.7085 863.7988 953.4655 1007.0912 1052.6387 1126.7544 1160.7444 1165.5722 1254.5317 1311.6425 1329.7484 1336.6578 1348.8772 1364.9844 1440.5752 1516.2162 1541.4124 1551.0410 1585.3884 3158.9326 3182.2293
redmass: 19.3195 23.9668 26.7490 34.2307 28.9135 28.9034 25.8774 7.7869 30.4569 28.1844 14.3631 34.7035 30.9571 31.2296 34.2851 28.1682 7.1622 19.8844 24.9966 12.4803 30.4341 7.3507 11.8926 32.2787 9.2888 11.7936 9.7684 4.5920 8.2176 12.0736 12.5801 11.1482 10.1354 8.3721 9.2086 10.9000 5.9042 11.5804 3.1068 2.2222 10.4069 1.3608 10.8269 8.3252 4.7229 1.5358 2.6227 5.2072 11.9901 12.0018 4.9866 7.3229 4.0249 4.1286 11.9876 8.2358 11.2277 7.8528 1.0894 1.0971
irintensity: 0.2191 0.0353 0.0395 0.0004 0.0170 0.0280 0.0668 0.5746 0.0125 0.0254 0.2161 0.1015 0.0255 0.1031 0.0015 0.1817 2.7059 1.0901 0.1251 0.0380 0.0012 0.2559 0.6164 0.1059 14.8140 7.8363 11.7949 0.9381 0.1213 0.0338 21.7027 15.8721 0.4438 61.4608 37.4754 62.6434 10.2698 0.4808 9.9528 8.3719 12.4370 0.2432 0.1823 23.8905 14.0478 14.3042 12.6039 60.8105 171.2579 11.9955 31.3718 33.9128 155.3457 26.2876 0.0328 5.0536 16.3867 13.6299 1.7748 1.0761
temp: 298.150 k
press: 1.00000 atm
elementType: 35 17 17 17 17 17 17 17 6 6 6 6 6 6 6 6 6 6 6 6 1 1
symmnumber: 1
zpe: 263152.5 jmol-1
zpe.correction: 0.100229 hartree
zpe.thermalcorrener: 0.120148 hartree
zpe.thermalcorrenthalpy: 0.121092 hartree
zpe.thermalcorrgfe: 0.047298 hartree
zpe.sumelectzpe: -3690.931025 hartree
zpe.sumelectthermal: -3690.911107 hartree
zpe.sumelectthermalent: -3690.910163 hartree
zpe.sumelectthermalfe: -3690.983957 hartree
dipole: -0.0145 0.0022 -2.3827
dipole: 2.3828
quadrupole: -174.7434 -174.1356 -165.8339
quadrupole: 0.0044 -4.4914 -0.0075
quadrupole: -3.1724 -2.5646 5.7370 0.0044 -4.4914 -0.0075
hfenergy: -3691.0312549 hartree
pointgroup: C01 [X(C12H2Br1Cl7)]
dipole: -0.0245343 0.0023926 -0.9371227 debye
dipolederiv: -0.6917196 -0.0003813 0.1232046 -0.0002611 0.0207611 0.0000528 0.1329553 0.0000909 -0.0079156 -0.2491741 0.266973 0.0156332 0.2700091 -0.5039252 -0.0219779 0.0252331 -0.0199255 0.0033799 -0.2490897 -0.2669339 0.014503 -0.2700803 -0.5042973 0.0198402 0.0241572 0.017773 0.0035305 -0.2339692 -0.0005918 0.2292053 -0.000686 -0.0056571 0.0013058 0.2668026 0.0013091 -0.5211067 -0.2227771 0.2862375 0.0091251 0.3423084 -0.4954047 -0.0161257 0.0179662 -0.0204448 0.016834 -0.2223852 -0.2861682 0.0078899 -0.3420836 -0.4957583 0.0139499 0.0167216 0.0183327 0.0169349 -0.7370976 -0.0002049 0.0410721 -0.0002057 -0.0017201 -0.0000391 0.05428 -0.00002 0.0161723 -0.2770683 0.0007086 -0.2820484 0.0008746 0.0018057 0.0011001 -0.3595662 0.0010611 -0.4188644 0.3032888 -0.0000236 0.0390327 -0.0001751 -0.2932713 -0.0005479 0.0348562 -0.0006231 0.0076248 0.2193677 -0.0000886 0.0584896 -0.0001768 0.0070872 0.0003427 0.1116848 0.000413 -0.1358022 0.2114659 -0.4540129 -0.0267311 -0.4696807 0.6293169 0.0390044 -0.0219542 0.0167782 -0.0283721 0.2116097 0.4539746 -0.0248682 0.4693927 0.6298586 -0.0361181 -0.0202745 -0.0140035 -0.0285467 0.165014 0.0011148 -0.4475165 0.0009862 -0.0096947 -0.0016982 -0.394348 -0.0016593 0.65409 -0.0773164 -0.0000291 0.0035433 0.0005539 -0.0914343 -0.0004507 -0.1504769 -0.0004202 0.0616277 -0.0129099 -0.5393392 0.0014497 -0.6076387 0.6085166 0.0349754 -0.0082287 0.0359633 -0.0256707 -0.0129313 0.5391235 0.0036466 0.6075302 0.6091959 -0.0324132 -0.0058702 -0.0333416 -0.0258996 1.0148882 0.0003425 -0.0678423 0.0004091 -0.2054801 -0.0003901 -0.0740285 -0.0004101 -0.017932 -0.0174921 -0.0017142 0.6660358 -0.0016283 -0.0044403 -0.001208 0.6327495 -0.0012203 0.4636902 -0.3916586 -0.000042 0.0015476 -0.0000366 -0.0743862 -0.0002152 0.007338 -0.000212 0.0010365 1.2020215 0.0010066 -0.3427039 0.0005199 -0.1081978 -0.0001316 -0.2502747 -0.000159 -0.0440805 0.0265713 0.0001689 -0.0647419 0.0002196 0.1321861 0.0003156 -0.0837011 0.0002978 0.0129598 0.0413621 -0.0001204 0.0420739 -0.0001508 0.1549391 0.0004286 0.0439786 0.0004201 -0.0036902 unknown
polarizability: 321.8890303|0.0393289|187.4665055|-12.4323697|0.0444583|148.3029777 unknown
InChI: InChI=1S/C12H2BrCl7/c13-4-2-1-3(6(14)7(4)15)5-8(16)10(18)12(20)11(19)9(5)17/h1-2H
charge 0 multiplicity 1
22 atoms
Br 5.677604 0.002965 -0.892071
Cl -0.386988 -2.769906 -0.208967
Cl -0.387971 2.771091 -0.197352
Cl 1.019955 -0.005982 2.446639
Cl -3.597659 2.782312 0.035866
Cl -3.596668 -2.783247 0.024356
Cl -5.200769 -0.000987 0.149602
Cl 4.228119 -0.005079 2.133478
C  -0.56436 0.000547 -0.198502
C  0.927251 0.001094 -0.331793
C  -1.293873 -1.212578 -0.146999
C  -1.294309 1.213186 -0.141958
C  1.772048 -0.001761 0.803422
C  1.519576 0.004497 -1.61621
C  -2.703693 1.225267 -0.035303
C  -2.703252 -1.225601 -0.040377
C  -3.409499 -0.000403 0.015331
C  3.182344 -0.001302 0.669433
C  2.918779 0.005032 -1.768608
C  3.749307 0.002125 -0.627968
H  0.87716 0.006747 -2.501709
H  3.367698 0.007683 -2.764811
