program: Gaussian 09
title: 000184291
version: EM64L-G09RevD.01
frameworkgroup: C1[X(C21H15NO2)]
method: RPBEPBE
basis: SDD
operation: Freq
keyword: #p
keyword: freq=noraman
keyword: PBEPBE/SDD
title: #p freq=noraman PBEPBE/SDD
converged: YES YES NO NO
title: Mulliken charges:
elementType: O O N C C C C C C C C C C C C C C C C C C C C C H H H H H H H H H H H H H H H
charge: -0.428000 -0.434181 -0.027801 -0.314118 0.286374 0.225714 -0.195080 -0.246942 0.471355 0.283446 -0.416820 -0.348887 -0.265163 -0.440037 -0.127873 -0.468943 0.241728 0.423653 -0.362099 -0.449236 -0.379504 -0.435530 -0.261644 -0.242857 0.268197 0.258580 0.249251 0.285856 0.242074 0.241863 0.239276 0.265695 0.241745 0.342630 0.224757 0.343606 0.243844 0.231826 0.233245
chargesum: 0.00000
title: Mulliken charges with hydrogens summed into heavy atoms:
elementType: O O N C C C C C C C C C C C C C C C C C C C C C
charge: -0.085370 -0.090575 -0.027801 -0.045921 0.286374 0.225714 0.063500 -0.246942 0.471355 0.283446 -0.167568 -0.063032 -0.023089 -0.198175 -0.127873 -0.229668 0.241728 0.423653 -0.096404 -0.207491 -0.154747 -0.191686 -0.029818 -0.009611
polarizability: 5.00392804e+02 8.34925990e-01 2.47716611e+02 2.75261633e+00 9.57770884e+00 1.11821964e+02
1716.lowfreq: -1.8745 0.0001 0.0006 0.0007 3.6776 9.2586 32.5979 47.7591 65.7111
frequency: 32.5779 47.6287 65.7093 85.3467 109.4866 136.6448 155.1900 185.8714 197.0661 210.6556 259.8177 267.2578 301.2359 310.0135 318.8085 339.9280 373.8708 387.0827 404.7949 430.7196 447.5797 459.4917 479.1931 501.5820 504.9332 516.6636 539.9430 547.5614 553.1781 594.1118 613.8844 633.0315 667.4628 690.8681 713.2867 731.1887 742.5820 757.0761 763.3132 776.6487 805.6251 823.2483 833.9931 854.2086 856.7175 867.9267 873.0397 891.8926 911.4060 927.7990 933.6153 945.6644 960.4702 971.8438 989.8157 998.6021 1003.9891 1015.3597 1040.6610 1048.6782 1099.6006 1117.1491 1148.2101 1159.5142 1179.4010 1184.5063 1190.6162 1206.1088 1213.9258 1218.2943 1231.2430 1239.0091 1253.4341 1288.5057 1297.7581 1320.6485 1338.1065 1346.2733 1354.1349 1356.6031 1373.9191 1384.2419 1399.4540 1408.8858 1419.1403 1436.3252 1459.3739 1470.3153 1507.7519 1531.0534 1557.2758 1588.3783 1599.8304 1613.9017 1622.3719 1631.6656 3064.6523 3067.8799 3124.3102 3125.4628 3129.8513 3133.1671 3138.8549 3141.2967 3149.7139 3151.1683 3166.8808 3168.4251 3168.5618 3538.8974 3541.7130
redmass: 6.2934 5.0569 5.4203 4.7978 6.0343 5.6444 4.7072 5.2711 4.0799 5.7611 4.2909 3.8507 1.1296 1.3201 3.3655 4.5997 5.6714 4.8924 3.8099 3.1802 5.4661 5.8267 4.2224 5.3307 5.1787 4.4871 4.2316 3.6501 4.1650 4.5859 5.6623 5.6891 4.5040 7.4519 3.4429 5.3976 4.3273 5.7116 1.3024 1.8443 2.0764 1.6477 2.8494 2.1382 4.2017 4.2083 3.5663 1.6932 4.8451 1.7492 6.1362 4.1855 1.3865 1.4021 1.3388 1.3739 1.5627 2.5936 2.2965 2.9592 2.1441 1.9902 1.3065 1.0924 1.0798 1.2349 1.5771 1.6239 1.6829 1.4463 1.6752 1.9671 2.3248 1.9694 2.4803 2.2476 1.6948 1.9021 1.1948 2.1181 2.3188 2.1545 4.6234 2.8733 5.7711 3.8502 2.6459 3.1994 3.7966 8.2144 6.8712 5.9491 7.0610 6.5546 6.5790 6.9667 1.0852 1.0863 1.0873 1.0867 1.0886 1.0897 1.0899 1.0871 1.0972 1.0934 1.1002 1.0978 1.0970 1.0663 1.0664
irintensity: 0.0075 0.6797 0.1559 3.0546 0.2549 1.6733 3.1160 0.5688 0.6079 2.9470 0.6744 4.5342 47.6340 128.6678 15.3841 14.0435 12.6145 2.1917 0.8926 5.9527 2.3659 2.4959 2.4302 0.9089 1.8855 0.0728 2.6661 8.0295 2.4525 2.5859 4.2999 4.3901 19.4010 3.4965 3.4358 6.2017 6.3511 3.9544 62.9332 16.9754 2.8720 17.8271 28.8797 38.1735 45.6730 10.0322 38.3422 3.5425 111.2391 25.9640 31.8389 30.4418 5.7094 3.3479 0.0057 0.2231 6.7729 3.1530 6.7637 1.5259 4.1051 0.9962 0.8936 9.9909 2.6065 63.3612 33.4281 18.5033 1.9726 28.2333 4.6561 4.0943 1.5869 1.2612 2.6280 8.1841 5.7366 17.2311 51.6129 27.6909 23.5933 42.9765 2.5346 10.7300 0.4173 2.7970 1.3375 7.3364 21.7802 9.2372 2.1504 2.3931 12.6420 13.6118 0.5183 0.5363 13.9408 15.4185 1.3230 1.9970 7.4121 9.9298 1.8895 2.7048 14.2467 34.9752 41.6201 16.1960 15.1495 14.9813 13.4091
temp: 298.150 k
press: 1.00000 atm
elementType: 8 8 7 6 6 6 6 6 6 6 6 6 6 6 6 6 6 6 6 6 6 6 6 6 1 1 1 1 1 1 1 1 1 1 1 1 1 1 1
symmnumber: 1
zpe: 789329.6 jmol-1
zpe.correction: 0.300640 hartree
zpe.thermalcorrener: 0.318894 hartree
zpe.thermalcorrenthalpy: 0.319838 hartree
zpe.thermalcorrgfe: 0.254644 hartree
zpe.sumelectzpe: -1012.817421 hartree
zpe.sumelectthermal: -1012.799167 hartree
zpe.sumelectthermalent: -1012.798223 hartree
zpe.sumelectthermalfe: -1012.863417 hartree
dipole: 5.0447 0.5870 -0.0349
dipole: 5.0788
quadrupole: -142.7877 -123.3233 -144.4706
quadrupole: 4.4849 2.8507 5.0487
quadrupole: -5.9272 13.5372 -7.6101 4.4849 2.8507 5.0487
hfenergy: -1013.1180605 hartree
pointgroup: C01 [X(C21H15N1O2)]
dipole: 1.9841989 -0.235065 0.0182987 debye
polarizability: 500.3936093|-1.4152021|247.9010176|-2.2853704|8.2081631|111.6367518 unknown
InChI: InChI=1S/C21H15NO2/c23-19-10-8-15-16(21(19)24)7-5-13-11-17-14-4-2-1-3-12(14)6-9-18(17)22-20(13)15/h1-11,19,21,23-24H
charge 0 multiplicity 1
39 atoms
O  -5.085529 -0.94454 1.591903
O  -5.509634 0.68474 -1.743149
N  -0.104644 1.204238 0.139352
C  -4.686284 -0.689655 0.17946
C  -3.18305 -0.867022 0.03561
C  -2.347083 0.267366 0.096089
C  -5.213147 0.692201 -0.282251
C  -0.907795 0.093634 0.063762
C  -0.355793 -1.246827 -0.052947
C  1.901071 -0.259077 -0.01394
C  -2.624753 -2.179821 -0.079786
C  -2.930321 1.614517 0.195891
C  -4.272774 1.831602 0.046513
C  1.057932 -1.385196 -0.089734
C  1.250208 1.041891 0.10444
C  -1.245626 -2.371066 -0.126109
C  3.367949 -0.329028 -0.045775
C  4.126869 0.891771 0.044769
C  2.061966 2.238472 0.192152
C  3.437868 2.163681 0.163743
C  4.080499 -1.558899 -0.163241
C  5.552347 0.84221 0.016527
C  5.483774 -1.588432 -0.189555
C  6.228697 -0.380191 -0.098764
H  -5.236665 -1.461429 -0.383617
H  -6.204865 0.831264 0.179833
H  -3.305273 -3.037777 -0.117575
H  -2.226086 2.436846 0.353845
H  -4.689333 2.843881 0.08524
H  1.47494 -2.394159 -0.177865
H  -0.824504 -3.379317 -0.216066
H  1.530838 3.190549 0.280705
H  4.043703 3.075114 0.230783
H  -4.527007 -0.373281 2.181433
H  3.534787 -2.505113 -0.235938
H  -4.659112 0.836268 -2.231672
H  6.114848 1.780652 0.086887
H  6.007317 -2.546186 -0.280731
H  7.323265 -0.408083 -0.119422
