program: Gaussian 09
title: 000184269
version: EM64L-G09RevD.01
frameworkgroup: C1[X(C6H6Cl2N2)]
method: RPBEPBE
basis: SDD
operation: Freq
keyword: #p
keyword: freq=noraman
keyword: PBEPBE/SDD
title: #p freq=noraman PBEPBE/SDD
converged: YES YES NO NO
title: Mulliken charges:
elementType: Cl Cl N N C C C C C C H H H H H H
charge: -0.041738 -0.041739 -0.698570 -0.698570 0.635197 0.635197 -0.330529 -0.330528 -0.404542 -0.404543 0.219898 0.219898 0.306002 0.314282 0.314282 0.306002
chargesum: 0.00000
title: Mulliken charges with hydrogens summed into heavy atoms:
elementType: Cl Cl N N C C C C C C
charge: -0.041738 -0.041739 -0.078286 -0.078286 0.635197 0.635197 -0.330529 -0.330528 -0.184644 -0.184644
polarizability: 1.36988245e+02 1.41764953e-05 1.19947347e+02 5.81888208e-03 3.49264780e-05 3.85803207e+01
1716.lowfreq: -7.3395 -6.4268 -0.0029 -0.0022 0.0011 5.2258 90.7572 135.2888 199.0110
frequency: 90.7537 135.2888 199.0110 221.0716 255.9631 272.9417 286.3364 305.9865 336.9746 353.2229 378.3732 378.8312 447.2076 470.6942 493.1501 504.4175 590.0662 710.7236 713.8863 787.7634 825.2507 905.8724 907.3950 1020.6418 1036.6380 1102.8393 1161.7106 1302.5961 1353.9586 1375.7176 1421.8327 1515.8573 1554.2233 1616.9093 1623.8575 1660.3985 3124.5715 3148.2279 3564.7398 3566.9974 3712.4285 3712.4913
redmass: 12.6107 4.5210 30.2506 3.6104 6.0714 1.0905 1.2834 3.7385 7.8344 15.5826 1.0729 1.1130 6.4001 3.7921 6.7732 2.9781 3.7218 7.6419 5.6537 1.5657 7.3824 4.5709 1.3879 1.7979 1.7169 2.5076 1.1553 1.5672 6.0734 5.6984 5.6180 4.2114 7.2625 1.2403 1.1789 5.1471 1.0867 1.0969 1.0446 1.0454 1.1039 1.1039
irintensity: 0.0000 1.4092 0.1315 72.9251 0.3975 0.0007 299.8289 13.1338 0.0000 0.9429 285.2097 0.0054 0.3238 0.0003 7.3949 0.8208 3.5629 1.0485 0.0009 63.6533 79.7216 21.7152 0.0622 7.5033 66.7739 4.9344 3.1791 36.7860 1.0372 62.4993 3.0940 354.6138 7.2211 0.2046 389.8580 14.0127 15.6935 19.3350 144.9588 2.3738 1.9056 61.2177
temp: 298.150 k
press: 1.00000 atm
elementType: 17 17 7 7 6 6 6 6 6 6 1 1 1 1 1 1
symmnumber: 1
zpe: 293969.2 jmol-1
zpe.correction: 0.111967 hartree
zpe.thermalcorrener: 0.122256 hartree
zpe.thermalcorrenthalpy: 0.123200 hartree
zpe.thermalcorrgfe: 0.076508 hartree
zpe.sumelectzpe: -1261.136287 hartree
zpe.sumelectthermal: -1261.125999 hartree
zpe.sumelectthermalent: -1261.125054 hartree
zpe.sumelectthermalfe: -1261.171746 hartree
dipole: 0.0000 3.3514 0.0000
dipole: 3.3514
quadrupole: -52.7381 -65.8728 -77.6414
quadrupole: 0.0000 0.0553 0.0001
quadrupole: 12.6793 -0.4553 -12.2240 0.0000 0.0553 0.0001
hfenergy: -1261.2482543 hartree
pointgroup: C01 [X(C6H6Cl2N2)]
dipole: -0.000069 -1.3185456 -0.000059 debye
dipolederiv: -0.2790975 -0.2702855 0.0001622 -0.2831876 -0.5176577 0.0000556 0.0003918 0.0000984 -0.044118 -0.2790388 0.2702601 0.0001852 0.2831622 -0.5177167 -0.0000957 0.0004161 -0.0001388 -0.0441186 -1.5805072 0.0913148 -0.0008004 0.0362196 -0.1201848 -0.0022812 -0.003288 -0.001661 -0.7401827 -1.5805205 -0.0911595 -0.0008075 -0.0360635 -0.1201715 0.002352 -0.0032884 0.0017293 -0.7401826 1.4116036 -0.209272 0.0005745 -0.1319788 -0.4305629 0.0008628 0.0007162 0.0011402 0.1174044 1.4116397 0.2090761 0.0005944 0.131783 -0.4305989 -0.000915 0.0007288 -0.0011909 0.1174043 0.0939325 0.0167951 -0.0000102 0.8328128 0.670587 -0.0003793 -0.0010837 -0.0011183 -0.0808622 0.0938417 -0.0167338 -0.000011 -0.8327514 0.670678 0.0004434 -0.0011622 0.0011835 -0.0808617 -0.1183679 0.4168694 -0.0003032 -0.3136868 0.1804993 0.0003285 0.0007996 -0.0007879 -0.2000994 -0.1183789 -0.4168382 -0.0003409 0.3137179 0.1805088 -0.0002968 0.0008294 0.0008195 -0.2000994 0.0009374 0.1014014 0.0001309 0.0816413 -0.0679399 -0.0002035 -0.0000128 -0.0002245 0.1696455 0.0009183 -0.1014083 0.0001226 -0.0816483 -0.0679196 0.0001844 -0.0000191 0.0002051 0.1696459 0.2251791 -0.015855 0.0002816 -0.0345694 0.1173659 0.0006022 0.0004188 0.0002269 0.391823 0.2463377 -0.001363 -0.0000296 0.0131089 0.1678757 0.0011004 0.002068 0.0010435 0.3863894 0.2463366 0.0013548 -0.0000316 -0.0131177 0.1678771 -0.0011251 0.0020713 -0.0010675 0.3863894 0.2251842 0.0158436 0.000283 0.0345578 0.1173602 -0.0006325 0.0004143 -0.0002575 0.3918228 unknown
polarizability: 136.9882372|-0.0009092|119.9473467|-0.0281765|0.0035268|38.5803286 unknown
InChI: InChI=1S/C6H6Cl2N2/c7-5-3(9)1-2-4(10)6(5)8/h1-2H,9-10H2
charge 0 multiplicity 1
16 atoms
Cl 1.629495 2.221223 -0.00043
Cl -1.629257 2.221396 0.000324
N  2.847977 -0.559353 -0.000216
N  -2.848035 -0.55905 -0.000131
C  1.452084 -0.560221 -0.000617
C  -1.452142 -0.560067 0.000272
C  0.704519 0.649637 0.000029
C  -0.704448 0.649711 -0.000269
C  0.702148 -1.770995 -0.000852
C  -0.702336 -1.770921 0.000407
H  1.241134 -2.725391 -0.001578
H  -1.241423 -2.725259 0.001056
H  3.362241 -1.433783 0.001079
H  3.358768 0.31897 -0.005609
H  -3.358734 0.319326 0.00536
H  -3.362391 -1.433425 -0.001528
