program: Gaussian 09
title: 000184278
version: EM64L-G09RevD.01
frameworkgroup: C1[X(C12H12BrN5)]
method: RPBEPBE
basis: SDD
operation: Freq
keyword: #p
keyword: freq=noraman
keyword: PBEPBE/SDD
title: #p freq=noraman PBEPBE/SDD
converged: YES YES NO NO
title: Mulliken charges:
elementType: Br N N N N N C C C C C C C C C C C C H H H H H H H H H H H H
charge: 0.001799 -0.166715 -0.093371 -0.167639 -0.018171 -0.124214 0.100894 -0.189029 0.324344 0.027024 0.228107 -0.637641 -0.382265 -0.277871 -0.211723 -0.632090 -0.601782 -0.202369 0.246970 0.279065 0.252194 0.266340 0.274919 0.250034 0.246125 0.240462 0.242267 0.267083 0.242489 0.214763
chargesum: 0.00000
title: Mulliken charges with hydrogens summed into heavy atoms:
elementType: Br N N N N N C C C C C C C C C C C C
charge: 0.001799 -0.166715 -0.093371 -0.167639 -0.018171 -0.124214 0.100894 -0.189029 0.324344 0.027024 0.228107 0.140588 -0.115925 -0.002952 0.038312 0.096763 0.122554 -0.202369
polarizability: 4.03485855e+02 -2.05464382e+00 1.64226201e+02 -1.73690492e+00 1.06347738e+00 8.24291440e+01
1716.lowfreq: 0.0005 0.0006 0.0008 1.6399 4.5988 9.0181 36.8094 66.7850 84.8350
frequency: 36.7940 66.7812 84.8274 94.1641 104.0777 120.5394 160.7558 189.8952 191.0785 203.5247 214.2833 234.6903 278.5284 288.3656 323.7580 334.4840 340.1377 400.5383 418.4286 443.4784 462.9322 473.0944 535.3990 575.2261 597.6513 608.6533 626.4511 678.0922 696.2043 713.2273 741.0212 770.5807 825.0855 831.2493 883.1154 892.9318 910.3671 958.7185 980.0965 1018.0768 1039.0174 1054.8992 1092.2124 1105.9708 1116.2095 1119.0790 1139.8991 1148.6014 1171.4827 1192.8175 1211.6455 1225.3731 1274.3698 1294.8104 1364.3110 1377.4350 1409.8351 1423.6243 1429.0482 1432.9938 1441.0351 1453.1631 1455.0936 1467.5575 1476.7720 1482.2676 1487.9518 1496.9367 1533.4273 1541.3530 1576.6066 1620.4450 2965.1855 2975.9646 3005.4534 3044.9332 3061.1839 3097.2402 3127.3570 3132.5229 3134.4791 3153.5444 3176.7378 3179.5398
redmass: 5.9030 2.1907 5.7133 3.0736 2.6925 2.5141 1.2557 5.4913 4.6094 1.9434 1.5999 3.0149 3.8025 3.3628 6.3144 3.7589 3.5043 4.3832 3.9634 6.2608 4.0377 5.2239 7.8572 7.0184 4.6500 6.4841 7.3487 9.4184 6.6743 7.9353 6.5680 3.7073 1.7724 5.2275 1.4814 5.6242 5.6994 1.3580 3.6613 3.8538 2.0681 1.4702 1.2725 2.6031 1.4596 1.7686 1.5017 2.6139 2.9265 3.3407 3.0194 2.5250 2.4821 3.6961 4.0399 3.3565 1.8557 1.7791 1.5187 1.4671 2.6319 1.1563 1.0680 1.1410 1.1475 1.3054 2.1322 1.3114 2.6268 4.1579 8.1163 8.4989 1.0407 1.0388 1.0333 1.0975 1.0989 1.1006 1.0973 1.1029 1.0987 1.0894 1.0957 1.0941
irintensity: 0.8210 7.2106 0.6345 0.9739 10.8577 2.4621 1.1630 2.1931 1.1611 1.0391 1.2957 2.1371 18.4114 0.6859 3.8359 12.9582 3.3042 16.3056 1.1889 12.0530 8.4240 11.5665 14.3711 1.8213 11.8410 4.2026 8.5547 7.3244 11.6155 8.6123 0.3881 2.9774 50.0124 109.0635 21.4303 8.0679 82.4289 0.5830 78.4248 37.6717 34.6137 14.0589 23.6067 31.6257 5.5787 2.8809 75.8186 19.0075 0.9133 273.3682 15.6457 64.4253 44.7868 22.4024 41.9929 13.8396 208.7220 114.4251 47.3010 9.5976 14.2136 8.3069 47.9001 2.3192 12.4302 30.4487 8.8445 12.0336 696.8006 36.5804 14.1956 93.1911 79.8881 128.3015 27.7972 34.9271 27.4138 10.0911 17.7607 0.6729 11.0656 1.1616 5.3922 1.3278
temp: 298.150 k
press: 1.00000 atm
elementType: 35 7 7 7 7 7 6 6 6 6 6 6 6 6 6 6 6 6 1 1 1 1 1 1 1 1 1 1 1 1
symmnumber: 1
zpe: 592257.3 jmol-1
zpe.correction: 0.225579 hartree
zpe.thermalcorrener: 0.241961 hartree
zpe.thermalcorrenthalpy: 0.242905 hartree
zpe.thermalcorrgfe: 0.180889 hartree
zpe.sumelectzpe: -750.361696 hartree
zpe.sumelectthermal: -750.345315 hartree
zpe.sumelectthermalent: -750.344371 hartree
zpe.sumelectthermalfe: -750.406386 hartree
dipole: -7.2564 -2.8206 0.2290
dipole: 7.7887
quadrupole: -86.1573 -115.2152 -115.5205
quadrupole: 17.0630 -2.0009 0.1112
quadrupole: 19.4737 -9.5842 -9.8895 17.0630 -2.0009 0.1112
hfenergy: -750.5872752 hartree
pointgroup: C01 [X(C12H12Br1N5)]
dipole: 2.9200721 -0.8964789 -0.2438996 debye
polarizability: 401.572683|11.3309153|156.8274161|19.7952023|25.1993616|91.7411005 unknown
InChI: InChI=1S/C12H12BrN5/c1-17(2)12-16-15-10-8-5-4-7(13)6-9(8)14-11(10)18(12)3/h4-6H,1-3H3
charge 0 multiplicity 1
30 atoms
Br -5.958255 -0.688588 -0.602416
N  1.782506 -0.904877 -0.046085
N  -0.5623 -1.469676 -0.442728
N  4.003133 -0.018396 0.229609
N  0.81342 1.686351 0.7273
N  2.178126 1.412657 0.644253
C  0.42019 -0.620331 -0.126143
C  -0.019438 0.728031 0.283335
C  -1.467084 0.671029 0.164551
C  -1.7488 -0.67432 -0.282182
C  2.627459 0.177047 0.258748
C  2.203151 -2.325727 -0.095452
C  -2.511206 1.592742 0.379672
C  -3.072471 -1.095342 -0.51501
C  -3.842463 1.177914 0.150109
C  4.667182 -0.66243 -0.927478
C  4.85368 0.956523 0.947155
C  -4.09269 -0.147405 -0.290031
H  2.334159 -2.673669 -1.134394
H  1.399258 -2.925989 0.359806
H  3.142869 -2.442449 0.464941
H  -2.30061 2.611702 0.718816
H  -3.286714 -2.111719 -0.853419
H  -4.675151 1.867804 0.310007
H  3.937588 -1.160085 -1.581899
H  5.410977 -1.407383 -0.591018
H  5.190186 0.10571 -1.532351
H  4.370152 1.25431 1.887916
H  5.022475 1.873293 0.349043
H  5.824869 0.474976 1.160548
