program: Gaussian 09
title: 000184259
version: EM64L-G09RevD.01
frameworkgroup: C1[X(C6H7ClO4)]
method: RPBEPBE
basis: SDD
operation: Freq
keyword: #p
keyword: freq=noraman
keyword: PBEPBE/SDD
title: #p freq=noraman PBEPBE/SDD
converged: NO NO NO NO
title: Mulliken charges:
elementType: Cl O O O O C C C C C C H H H H H H H
charge: 0.045210 -0.249351 -0.235573 -0.424847 -0.213558 -0.233711 -0.667189 0.361552 -0.219392 -0.177045 0.176775 0.237397 0.237380 0.215369 0.235646 0.235635 0.290517 0.385184
chargesum: 0.00000
title: Mulliken charges with hydrogens summed into heavy atoms:
elementType: Cl O O O O C C C C C C
charge: 0.045210 -0.249351 -0.235573 -0.039663 -0.213558 0.241066 0.019460 0.361552 -0.219392 0.113473 0.176775
polarizability: 1.39655443e+02 9.08237704e+00 9.60295555e+01 -1.58448198e-02 -3.78851236e-03 4.56888684e+01
1716.lowfreq: -22.0565 -4.6357 -0.0022 0.0007 0.0015 7.5349 17.5005 51.9369 58.6430
frequency: -11.7902 51.8551 58.1263 88.8902 110.5076 154.5992 175.7351 238.1020 249.9028 265.2717 325.3483 364.5862 435.7748 437.7042 550.8414 600.7675 673.9677 690.8865 722.9508 731.7008 795.3213 810.0499 913.5226 921.3710 995.5209 1019.2002 1050.5383 1113.8505 1134.5122 1195.8427 1240.7696 1249.4912 1316.9791 1355.6334 1401.2813 1462.7466 1470.5618 1484.1415 1597.2983 1631.0751 1639.6400 2998.9137 3012.5627 3072.8410 3096.2339 3112.0208 3162.3256 3522.8540
redmass: 3.0730 13.4636 4.2375 5.0100 3.2345 9.2447 2.9795 7.6323 1.3185 7.6157 7.3821 4.9363 7.9837 6.6018 4.6533 1.2152 7.5314 3.3513 10.2742 8.6320 1.1046 3.9212 7.0762 1.4585 4.0489 2.3585 2.8073 2.2701 1.4692 3.7785 1.7087 1.1314 1.9600 1.3980 1.2612 1.0397 1.0661 1.0645 11.5222 7.9371 9.1431 1.0358 1.0581 1.1069 1.0986 1.1027 1.0896 1.0642
irintensity: 0.3976 1.2294 2.4589 1.2984 1.0727 0.7591 1.6119 1.4818 0.6262 6.1328 13.9468 4.5926 0.8063 4.9949 66.9763 147.4827 24.7121 10.3758 40.5102 18.3798 3.5835 4.9789 63.6850 19.9306 25.1695 167.8833 209.2627 10.4540 6.6706 564.4093 100.8799 0.0967 64.8149 0.6354 23.1449 12.9698 4.0459 15.4626 147.5139 84.3842 155.0739 17.3027 12.7255 7.1164 23.8989 37.4809 6.7051 55.0635
temp: 298.150 k
press: 1.00000 atm
elementType: 17 8 8 8 8 6 6 6 6 6 6 1 1 1 1 1 1 1
symmnumber: 1
zpe: 327206.3 jmol-1
zpe.correction: 0.124626 hartree
zpe.thermalcorrener: 0.135848 hartree
zpe.thermalcorrenthalpy: 0.136793 hartree
zpe.thermalcorrgfe: 0.086146 hartree
zpe.sumelectzpe: -992.936029 hartree
zpe.sumelectthermal: -992.924807 hartree
zpe.sumelectthermalent: -992.923863 hartree
zpe.sumelectthermalfe: -992.974509 hartree
dipole: 2.1717 -0.8214 0.0019
dipole: 2.3218
quadrupole: -49.9486 -79.9409 -69.2578
quadrupole: 4.8963 -0.0017 -0.0042
quadrupole: 16.4338 -13.5585 -2.8753 4.8963 -0.0017 -0.0042
hfenergy: -993.0606557 hartree
pointgroup: C01 [X(C6H7Cl1O4)]
dipole: -0.8570369 0.3161063 0.0003339 debye
dipolederiv: -0.0698176 -0.0113065 -0.0000665 -0.218484 -0.6070692 0.0003358 0.0001586 0.0004745 0.0198165 -1.6993292 -0.268065 0.0006176 -0.3804997 -0.5216003 0.0004059 0.0011656 0.0005309 -0.2613795 -0.7345667 0.1666857 -0.0002479 -0.0914042 -0.8638703 0.001149 0.0001175 0.0007198 -0.3075426 -0.9557277 -0.6233383 0.0001958 -0.5596372 -0.7632272 -0.0000649 0.0002518 0.0000745 -0.4388115 -0.778506 0.16487 -0.0003512 0.1637027 -0.7585128 0.000506 -0.0003519 0.0002573 -0.3109528 1.0371113 0.0541191 -0.0002154 -0.0762318 0.230775 0.0002036 -0.0003475 0.0000668 0.3527782 -0.114991 -0.084472 0.0002615 -0.0622797 -0.0077741 0.0002584 0.0002602 0.0002484 0.0539577 1.9434391 -0.0064211 0.0000081 0.3943844 0.9742313 -0.0016008 -0.0003926 -0.0012022 0.2711686 -0.1132519 0.1800676 -0.0000235 0.4228454 0.965289 -0.0004267 -0.0005882 -0.0006086 -0.0548445 -0.8294028 -0.1642101 -0.0002103 0.0396631 -0.2428986 0.0000708 -0.0006728 0.000002 -0.0743293 1.9469935 0.438506 0.0004911 0.0527476 1.2096616 -0.0007014 0.0009542 -0.0004553 0.2642462 -0.0615519 -0.0348119 -0.0289754 0.0442796 0.0065569 -0.0878751 0.0046327 -0.0956821 -0.0488852 -0.0616719 -0.0345369 0.0290185 0.0443685 0.007396 0.0876351 -0.0047942 0.0955556 -0.0498752 -0.1364006 0.0652397 -0.0000333 0.0868186 0.0438788 0.0001238 -0.0000611 0.0001371 0.1201822 0.119667 0.0211758 0.0364597 -0.0381953 0.0146626 -0.0975007 0.0111952 -0.1072035 -0.0549708 0.1196202 0.0211284 -0.0367521 -0.038115 0.0156556 0.0971827 -0.0112445 0.1068283 -0.0559393 0.1255106 -0.0059332 -0.0000383 0.0502836 0.0632186 0.0000974 -0.0001198 0.0000817 0.170788 0.2628756 0.1213029 -0.0001383 0.1657535 0.2336271 0.0002011 -0.0001632 0.0001749 0.4045931 unknown
polarizability: 139.502766|9.4407155|96.182191|0.0167551|-0.0434375|45.6889097 unknown
InChI: InChI=1S/C6H7ClO4/c1-2-11-6(10)4(7)3-5(8)9/h3,8H,2H2,1H3
charge 0 multiplicity 1
18 atoms
Cl 0.278573 -1.999629 0.00132
O  -2.055768 -0.293233 0.000129
O  -1.026751 1.799979 -0.002953
O  3.791363 1.062604 0.000865
O  3.279646 -1.212533 0.002173
C  -3.394241 0.386544 -0.000649
C  -4.445478 -0.716412 0.002729
C  -0.960271 0.545771 -0.001445
C  0.347915 -0.208131 -0.000035
C  1.509868 0.506979 0.00013
C  2.890106 -0.022077 0.001461
H  -3.446864 1.034124 0.893173
H  -3.448013 1.029747 -0.897556
H  -5.453764 -0.264159 0.002269
H  -4.350157 -1.356136 -0.890815
H  -4.348978 -1.3517 0.899301
H  1.410884 1.597701 -0.000822
H  4.722629 0.710663 0.001426
