program: Gaussian 09
title: 000184261
version: EM64L-G09RevD.01
frameworkgroup: C1[X(C13H14ClN3O3)]
method: RPBEPBE
basis: SDD
operation: Freq
keyword: #p
keyword: freq=noraman
keyword: PBEPBE/SDD
title: #p freq=noraman PBEPBE/SDD
converged: YES YES NO NO
title: Mulliken charges:
elementType: Cl O O O N N N C C C C C C C C C C C C C H H H H H H H H H H H H H H
charge: -0.049453 -0.215255 -0.273488 -0.219915 -0.223153 -0.061853 -0.133926 -0.090004 0.481768 -0.707559 0.095746 0.266514 -0.196864 -0.332177 -0.352280 -0.259880 -0.065639 -0.199117 -0.250539 -0.663415 0.262393 0.234480 0.240807 0.238011 0.264729 0.320848 0.231581 0.237554 0.225491 0.235706 0.261627 0.219643 0.225994 0.251625
chargesum: 0.00000
title: Mulliken charges with hydrogens summed into heavy atoms:
elementType: Cl O O O N N N C C C C C C C C C C C C C
charge: -0.049453 -0.215255 -0.273488 -0.219915 -0.223153 -0.061853 -0.133926 0.172389 0.481768 0.005739 0.095746 0.266514 0.067865 -0.011329 -0.120699 0.203165 -0.065639 0.036589 0.011088 0.033847
polarizability: 2.84088992e+02 3.91900793e-01 1.74374558e+02 -2.25685770e+01 1.00188238e+01 1.10082529e+02
1716.lowfreq: -6.4246 -1.4194 -0.0017 -0.0015 -0.0011 4.3880 11.8806 15.4629 25.9158
frequency: 9.0299 15.2102 25.7680 46.3568 69.2536 82.1722 83.1659 89.7897 132.9573 169.5403 177.3854 210.4060 212.3211 235.8042 239.3200 267.3283 296.2814 315.0065 315.9074 355.1734 374.7109 405.5337 428.2674 442.4094 474.9174 554.1862 577.1491 616.1783 623.1043 650.0607 680.4590 690.1515 710.2698 714.7908 752.2943 774.9116 777.4050 793.9931 817.9760 843.7450 886.8114 900.6146 916.2629 945.1570 968.8771 978.0331 982.1312 1010.6347 1033.3039 1044.2123 1071.5050 1081.3717 1094.6805 1097.2130 1114.9716 1150.6541 1157.7538 1180.8248 1196.6857 1228.3462 1272.7031 1276.8091 1283.0608 1292.1158 1321.0424 1354.3051 1355.0468 1387.1831 1389.5400 1391.8291 1411.7655 1441.1183 1458.1086 1463.1631 1464.5946 1474.3028 1476.9107 1483.8866 1498.6223 1585.4564 1609.1957 1658.3707 2992.7477 3007.6528 3031.3160 3037.9268 3087.8370 3093.7460 3111.5350 3119.5030 3120.3323 3147.0690 3166.9440 3182.6545 3196.1400 3257.4642
redmass: 4.8526 4.3713 5.3103 3.8603 5.7966 4.0004 6.8203 6.3595 5.7423 2.4589 3.3452 1.9571 1.2886 4.4687 2.5223 3.6823 5.1374 4.8289 3.6255 7.6419 8.6877 4.2257 5.2163 3.1623 4.7394 5.0876 5.4891 5.1381 4.2817 7.2110 2.1371 5.1661 8.3073 5.3732 7.2268 1.9676 1.5655 1.4295 1.7243 3.2715 1.3811 3.5868 1.4391 8.5269 1.3349 4.6756 5.5064 2.6299 2.3210 2.8964 2.0680 2.8322 1.5560 2.1568 3.0323 2.4991 1.6627 1.1326 3.8363 1.5526 6.8592 1.1283 1.4596 1.4913 1.3643 1.4280 3.0906 8.4891 1.2266 1.2255 4.6946 3.0040 1.0825 1.0495 1.0488 3.2654 1.0635 1.0535 6.9119 7.3002 6.7554 10.2313 1.0360 1.0350 1.0597 1.0845 1.0973 1.1030 1.1011 1.1005 1.1065 1.0870 1.0936 1.0982 1.0932 1.0993
irintensity: 0.2259 0.3169 1.5341 0.3189 0.6670 0.6464 4.2256 0.2432 1.9295 1.4841 0.9207 1.6211 1.3749 0.8713 0.5005 0.5345 0.5624 3.4562 14.9024 1.7342 5.0501 7.3858 10.1241 6.5141 1.4574 0.2247 13.8988 13.9741 1.0228 4.9972 24.8327 16.4864 14.9085 23.6597 74.3104 8.4983 26.8718 57.4756 2.7793 2.4458 0.0730 41.1350 25.6912 20.5236 0.3992 2.4143 12.4041 34.5395 26.5526 32.6352 18.4031 516.3895 6.1622 11.7576 82.6020 116.7035 10.7089 0.4376 22.2193 20.0689 205.7093 10.2086 71.0101 3.0498 15.2701 1.0069 0.5824 3.8310 16.1105 38.7028 18.3146 30.8634 6.2893 9.0181 22.5990 34.3870 9.6322 9.9530 784.4183 58.9488 120.9552 178.1396 18.9486 13.8662 27.0678 6.2590 34.3919 1.2697 17.4527 14.4798 33.8459 8.1930 7.5475 4.0158 6.3887 1.9981
temp: 298.150 k
press: 1.00000 atm
elementType: 17 8 8 8 7 7 7 6 6 6 6 6 6 6 6 6 6 6 6 6 1 1 1 1 1 1 1 1 1 1 1 1 1 1
symmnumber: 1
zpe: 669865.3 jmol-1
zpe.correction: 0.255138 hartree
zpe.thermalcorrener: 0.274613 hartree
zpe.thermalcorrenthalpy: 0.275558 hartree
zpe.thermalcorrgfe: 0.202709 hartree
zpe.sumelectzpe: -1352.273285 hartree
zpe.sumelectthermal: -1352.253810 hartree
zpe.sumelectthermalent: -1352.252866 hartree
zpe.sumelectthermalfe: -1352.325714 hartree
dipole: 1.9192 -4.0161 -1.3773
dipole: 4.6593
quadrupole: -97.4715 -114.8305 -126.3028
quadrupole: 12.3220 3.7364 -1.3778
quadrupole: 15.3968 -1.9622 -13.4345 12.3220 3.7364 -1.3778
hfenergy: -1352.5284233 hartree
pointgroup: C01 [X(C13H14Cl1N3O3)]
dipole: 0.6085222 1.6416933 0.5430047 debye
polarizability: 280.1362733|7.1768575|175.3765189|32.5355588|10.512576|113.0332864 unknown
InChI: InChI=1S/C13H14ClN3O3/c1-3-19-12(18)9(2)20-13-15-8-17(16-13)11-6-4-5-10(14)7-11/h4-9H,3H2,1-2H3
charge 0 multiplicity 1
34 atoms
Cl -5.482058 -2.29437 -1.234646
O  1.649529 -1.330261 0.876998
O  4.691689 0.681295 0.4243
O  3.04892 0.084831 -1.129334
N  -1.323026 0.390513 0.427074
N  -0.605365 -0.82519 0.368683
N  0.755249 0.933235 1.072599
C  2.976008 -0.769124 1.214942
C  -2.706767 0.41637 0.072772
C  3.86212 -1.968991 1.568361
C  0.628747 -0.423248 0.766363
C  3.529942 0.027607 0.019505
C  -0.485952 1.410013 0.845041
C  -3.321222 -0.787807 -0.347745
C  -3.446898 1.622473 0.142523
C  5.400378 1.490482 -0.618682
C  -4.682026 -0.750363 -0.692485
C  -4.810958 1.616952 -0.213212
C  -5.450092 0.429057 -0.636343
C  6.35082 0.609549 -1.43313
H  2.876005 -0.072768 2.067214
H  4.873459 -1.619764 1.833368
H  3.429378 -2.509433 2.42635
H  3.929564 -2.664623 0.714962
H  -0.787445 2.445297 0.966538
H  -2.732421 -1.705844 -0.395627
H  -2.979257 2.556556 0.467276
H  4.640767 1.968102 -1.261988
H  5.937001 2.252093 -0.031146
H  -5.386362 2.546781 -0.161187
H  -6.507638 0.421751 -0.91253
H  6.92648 1.236966 -2.138724
H  7.066269 0.087011 -0.774886
H  5.788863 -0.13745 -2.018304
