program: Gaussian 09
title: 000184282
version: EM64L-G09RevD.01
frameworkgroup: C1[X(C17H21NO3)]
method: RPBEPBE
basis: SDD
operation: Freq
keyword: #p
keyword: freq=noraman
keyword: PBEPBE/SDD
title: #p freq=noraman PBEPBE/SDD
converged: YES YES NO NO
title: Mulliken charges:
elementType: O O O N C C C C C C C C C C C C C C C C C H H H H H H H H H H H H H H H H H H H H H
charge: -0.247641 -0.294664 -0.214412 -0.475101 0.122628 0.159737 -0.115206 -0.499839 0.187409 0.001341 -0.325097 -0.528011 0.440054 -0.444121 -0.547909 -0.448038 -0.243024 0.272963 -0.683651 -0.257384 -0.662079 0.218985 0.210657 0.236636 0.323469 0.191980 0.224241 0.261689 0.214579 0.233472 0.219814 0.204577 0.225786 0.217232 0.215878 0.218648 0.229454 0.242650 0.220638 0.218429 0.222008 0.251224
chargesum: 0.00000
title: Mulliken charges with hydrogens summed into heavy atoms:
elementType: O O O N C C C C C C C C C C C C C C C C C
charge: -0.247641 -0.294664 -0.214412 -0.151632 0.122628 0.159737 0.103779 -0.052546 0.187409 0.001341 0.091124 -0.051743 0.440054 -0.210649 -0.123518 -0.222253 -0.025792 0.272963 -0.019671 0.205905 0.029581
polarizability: 2.28919108e+02 -2.02454364e+01 2.11883731e+02 2.21370261e+01 1.86771159e+01 1.51990890e+02
1716.lowfreq: -16.2244 -10.5673 -0.8630 -0.0006 -0.0002 0.0005 3.8588 19.6770 39.3713
frequency: -12.5249 19.2762 39.3457 56.0161 62.5869 78.5461 89.5470 106.4899 127.5981 133.3831 175.5649 192.8905 210.0769 226.9678 257.9725 266.0470 283.1493 299.5885 322.1841 339.2670 370.4458 409.4366 419.2119 451.1720 477.5746 499.7895 505.9070 541.1381 545.7339 566.6397 586.2708 604.3706 640.2476 672.4026 718.7907 732.9189 745.5785 752.5563 781.3914 796.5220 799.7180 814.6914 827.2407 853.0051 873.1590 891.0092 903.5204 930.0827 955.7229 959.7417 982.2876 1000.2368 1015.9150 1031.6779 1034.0329 1058.5062 1064.0347 1074.7212 1095.1514 1107.4313 1123.9992 1155.7192 1161.4589 1172.1568 1192.0744 1218.6576 1233.7628 1238.1035 1239.8717 1252.0187 1266.3776 1278.3798 1279.2095 1308.8686 1315.1518 1320.0043 1345.3240 1355.9560 1358.2689 1372.7049 1387.6493 1390.3679 1399.0743 1429.4633 1439.6088 1453.8146 1457.9056 1458.2810 1463.2112 1466.2157 1471.3060 1475.9461 1484.3221 1489.0094 1492.5264 1587.0178 1598.1098 1625.3231 1661.3799 2877.6595 2948.4381 2968.7337 2973.2410 2978.1705 2992.3460 3022.4792 3028.5427 3031.5080 3033.9561 3072.7321 3082.7270 3086.2681 3086.6766 3092.6896 3099.3103 3115.9827 3118.1201 3130.8149 3154.1468 3598.0501
redmass: 3.5297 3.9253 4.4149 2.8918 3.7113 3.8822 3.9162 3.9820 3.0127 4.3731 3.4583 1.7150 1.2358 2.1233 2.8312 3.5157 2.4564 2.2429 2.7932 3.8853 2.7675 4.6118 3.6224 3.1543 1.5458 3.7121 3.5840 3.6827 4.2385 3.9140 3.9147 4.1561 4.3632 6.4769 3.3768 2.8512 3.5122 1.8830 1.3333 1.9156 2.3198 1.8646 3.9517 3.7743 2.8508 1.4182 2.9891 2.5648 2.4462 1.3263 2.6042 2.4838 2.9883 2.3647 3.4711 2.3693 2.0127 1.8582 2.1656 1.7344 2.6285 1.7010 2.6239 1.2261 1.2455 1.2845 1.9167 1.3522 1.5904 1.5217 1.5409 1.3762 1.1555 1.3854 1.7225 1.6708 1.3901 1.5209 1.3494 1.8523 1.2393 1.2346 2.9353 4.1235 1.1460 1.1396 1.0889 1.1713 1.0474 3.1827 1.0543 1.0961 1.0519 1.3688 2.0545 8.3580 6.7114 6.9887 9.6312 1.0814 1.0690 1.0635 1.0594 1.0356 1.0360 1.1006 1.0598 1.0592 1.0966 1.0994 1.1008 1.0967 1.0979 1.1028 1.1025 1.0866 1.1060 1.0904 1.0988 1.0797
irintensity: 0.4677 0.5037 0.6561 0.1664 0.9117 1.4015 0.3804 0.4491 0.0522 1.1280 2.3098 0.3058 1.9583 0.3739 2.9169 5.8875 0.7303 7.8410 2.8283 7.3831 10.1463 3.3566 3.3447 11.5074 84.0331 13.3218 14.6558 4.3593 7.7278 0.2916 10.4428 4.9245 1.5763 3.0481 7.5044 14.0331 13.0598 34.4843 3.3591 6.0104 26.1718 0.6947 1.2336 1.7693 2.7581 0.1537 26.9983 10.7341 7.4624 0.9468 3.8660 3.3632 82.8129 31.9741 31.6713 7.3852 9.7916 7.5397 23.3305 8.6028 189.4890 1.3886 34.1737 4.3945 0.5889 23.2080 16.5731 26.0476 22.6826 2.8161 43.3965 5.4211 2.8110 9.5723 13.1028 20.4093 47.0299 21.3003 3.9396 9.4556 16.5213 21.0094 11.2827 8.1859 14.6356 11.5568 9.4232 6.4327 13.6520 13.5665 5.2886 7.5620 13.9279 12.6734 3.5538 0.4569 3.5169 0.3944 164.2354 64.6840 73.3443 42.4209 41.8346 32.8659 21.1020 30.8190 12.4692 22.2135 9.2038 73.4106 31.4090 41.1164 28.7874 3.7739 5.0828 6.8803 26.9048 18.8813 36.4794 48.8080
temp: 298.150 k
press: 1.00000 atm
elementType: 8 8 8 7 6 6 6 6 6 6 6 6 6 6 6 6 6 6 6 6 6 1 1 1 1 1 1 1 1 1 1 1 1 1 1 1 1 1 1 1 1 1
symmnumber: 1
zpe: 910882.6 jmol-1
zpe.correction: 0.346937 hartree
zpe.thermalcorrener: 0.366447 hartree
zpe.thermalcorrenthalpy: 0.367391 hartree
zpe.thermalcorrgfe: 0.298116 hartree
zpe.sumelectzpe: -939.280438 hartree
zpe.sumelectthermal: -939.260928 hartree
zpe.sumelectthermalent: -939.259984 hartree
zpe.sumelectthermalfe: -939.329259 hartree
dipole: -1.0566 1.9528 2.0503
dipole: 3.0222
quadrupole: -135.2089 -108.9089 -120.2910
quadrupole: 2.6214 7.7570 0.8620
quadrupole: -13.7393 12.5607 1.1786 2.6214 7.7570 0.8620
hfenergy: -939.6273751 hartree
pointgroup: C01 [X(C17H21N1O3)]
dipole: 0.5497412 -0.6740826 0.8106669 debye
polarizability: 234.5053509|-17.0174632|204.9174603|-19.6630043|-22.786021|153.3709175 unknown
InChI: InChI=1S/C17H21NO3/c1-3-11-6-5-7-12-13-8-9-21-14(10-15(19)20-4-2)17(13)18-16(11)12/h5-7,14,18H,3-4,8-10H2,1-2H3
charge 0 multiplicity 1
42 atoms
O  -2.605939 1.997241 0.365119
O  -1.635076 -2.054918 0.112314
O  -3.429393 -1.002013 -0.951533
N  0.504496 -0.039018 1.039973
C  -0.439304 0.925619 0.650467
C  0.136834 1.805355 -0.262953
C  -1.838361 1.057952 1.202721
C  -0.629665 2.976241 -0.826462
C  1.498437 1.358075 -0.484402
C  1.699193 0.191288 0.337227
C  -1.858713 3.240829 0.073312
C  -2.681077 -0.243937 1.286968
C  2.923905 -0.522026 0.383045
C  2.570266 1.830785 -1.286985
C  3.101977 -1.761287 1.24813
C  3.962924 -0.019375 -0.432295
C  3.793135 1.133939 -1.253554
C  -2.662909 -1.094517 0.028363
C  2.421278 -3.027671 0.658524
C  -1.478998 -2.957131 -1.073765
C  -2.402179 -4.172441 -0.953957
H  -1.791572 1.470786 2.239834
H  -0.004306 3.890576 -0.865162
H  -0.961959 2.765963 -1.862061
H  0.266359 -0.910552 1.510026
H  -1.53679 3.709252 1.029453
H  -2.598032 3.892028 -0.420546
H  -3.720952 0.066863 1.483921
H  -2.320105 -0.85048 2.136015
H  2.449006 2.71746 -1.919376
H  4.181751 -1.964197 1.372855
H  2.70131 -1.575493 2.265991
H  4.932838 -0.532308 -0.424898
H  4.634879 1.481782 -1.863059
H  1.331198 -2.884312 0.538593
H  2.578412 -3.902402 1.316352
H  2.838389 -3.263811 -0.336666
H  -1.697074 -2.373358 -1.984743
H  -0.413736 -3.238047 -1.051261
H  -2.216571 -4.865552 -1.795485
H  -2.218982 -4.717949 -0.011869
H  -3.460296 -3.863935 -0.990269
