program: Gaussian 09
title: 000184244
version: EM64L-G09RevD.01
frameworkgroup: C1[X(C16H18N4O)]
method: RPBEPBE
basis: SDD
operation: Freq
keyword: #p
keyword: freq=noraman
keyword: PBEPBE/SDD
title: #p freq=noraman PBEPBE/SDD
converged: YES YES NO NO
title: Mulliken charges:
elementType: O N N N N C C C C C C C C C C C C C C C C H H H H H H H H H H H H H H H H H H
charge: -0.169697 -0.215221 0.015102 -0.090026 -0.018219 0.298565 -0.169845 -0.665222 -0.724612 -0.735119 -0.734675 0.218349 0.516563 -0.410774 -0.394356 -0.151872 -0.370697 -0.374070 0.391483 -0.281349 -0.255699 0.222138 0.268644 0.223679 0.209587 0.215278 0.226748 0.224698 0.214099 0.244745 0.210719 0.261417 0.224123 0.242232 0.266222 0.276079 0.257036 0.260272 0.273676
chargesum: 0.00000
title: Mulliken charges with hydrogens summed into heavy atoms:
elementType: O N N N N C C C C C C C C C C C C C C C C
charge: -0.169697 -0.215221 0.015102 -0.090026 -0.018219 0.298565 0.052293 -0.172899 -0.072999 -0.051577 -0.038416 0.218349 0.516563 -0.168542 -0.128134 0.124206 -0.113661 -0.113798 0.391483 -0.007673 -0.255699
polarizability: 2.38010878e+02 2.85051694e+01 1.87136502e+02 -1.11711835e+01 6.17927162e+00 1.66665715e+02
1716.lowfreq: -0.0009 -0.0007 -0.0004 3.3002 5.3472 8.5682 19.6309 29.2960 35.0891
frequency: 19.5923 29.2801 35.0739 48.8940 52.5076 64.0689 109.8919 131.9488 141.5184 167.1257 184.5575 207.5960 209.2869 242.2178 244.0881 263.9113 287.0208 289.8274 321.4667 358.0495 372.5209 385.4769 401.5731 410.2615 428.1255 483.9600 496.6873 508.5282 544.8394 575.4306 612.2263 643.3778 651.8352 674.0278 705.6722 728.5651 742.9274 788.8384 802.4075 821.6829 850.7745 860.1860 862.2792 897.5212 901.4402 917.5433 923.5162 930.7122 931.6762 946.6224 975.2598 988.5069 992.7897 1007.5465 1014.5919 1026.8807 1059.4618 1100.4841 1117.0083 1157.6841 1167.1122 1172.2839 1187.3446 1190.1186 1206.2186 1216.2698 1220.4842 1231.1778 1246.5414 1283.6559 1287.9447 1308.1716 1314.2629 1334.0227 1353.8256 1371.1725 1379.5800 1384.6362 1408.3680 1412.6386 1435.7178 1458.7439 1463.2788 1468.3349 1476.2894 1482.9900 1489.4338 1497.0211 1499.6207 1565.9360 1618.6221 1643.5967 2177.9368 2968.7361 2971.9224 2983.4598 3017.2775 3022.5280 3062.4160 3067.6497 3068.3400 3072.0655 3077.1105 3084.0650 3091.2857 3124.4510 3140.6961 3161.4301 3167.0427 3255.4381 3264.5275
redmass: 8.0309 5.0809 4.5978 3.6715 5.9558 3.2206 6.5296 7.5899 6.6813 5.7291 2.8591 1.8600 2.3479 2.7070 1.2181 2.3381 2.3228 1.6173 3.1711 2.4016 2.8287 2.6531 2.8682 3.0527 4.1313 5.5435 3.6523 4.9692 7.4912 2.9964 4.1587 6.8584 3.1162 5.9169 4.8178 3.3253 3.9487 3.7548 1.5756 3.6027 1.7921 1.3047 1.3973 3.2835 4.4680 4.0072 2.5761 1.6447 2.0059 1.2301 1.3863 1.4836 2.1097 1.9567 2.7726 1.4865 2.3125 3.2795 1.4561 3.2594 1.8252 1.7022 1.4243 1.6874 1.9314 2.4685 2.4831 2.6094 2.0778 1.9623 2.3064 1.3829 1.3430 3.7798 2.0696 3.1327 1.2042 1.2160 1.2163 2.9605 4.0217 1.0555 1.0581 1.0526 1.0823 1.0589 1.0645 1.0603 2.4540 6.5117 6.2368 9.8182 12.6312 1.0357 1.0359 1.0362 1.0671 1.0749 1.1001 1.0990 1.0996 1.0997 1.0981 1.1026 1.0996 1.0892 1.0895 1.0957 1.0973 1.0970 1.1014
irintensity: 0.2531 0.9695 0.5831 0.3875 0.4732 0.7255 2.0345 3.3464 2.9464 1.8433 0.2423 0.0397 0.3637 0.8742 0.7672 1.0549 0.5862 1.2642 1.6524 1.1552 1.3655 0.4108 0.0795 0.1298 1.9262 4.3728 0.5844 8.4511 0.2475 32.9169 2.4023 0.2026 26.1469 0.3156 0.5542 11.1735 3.1384 10.8351 21.4883 8.6097 21.8594 5.5139 14.2726 51.2556 4.1941 89.2549 11.3469 4.5022 8.8817 0.3450 0.4529 3.5852 9.7518 4.4751 5.2591 0.8662 3.9429 27.9198 10.8195 55.2687 7.6617 142.8358 37.4783 2.8874 0.3374 20.8351 34.9920 3.7880 107.8510 31.5929 20.4576 10.4428 5.9337 16.1498 37.3289 2.4519 17.8641 31.3698 21.3553 6.7406 51.2151 0.4864 4.3026 1.7827 10.0053 8.8820 18.3356 34.5683 18.9928 0.0613 24.7248 110.9772 40.3779 28.6207 22.1434 21.9537 7.0531 24.3024 4.4874 41.6117 14.5852 18.8788 98.4701 5.0099 23.5523 11.1632 3.9108 7.7303 0.5505 0.7426 0.7973
temp: 298.150 k
press: 1.00000 atm
elementType: 8 7 7 7 7 6 6 6 6 6 6 6 6 6 6 6 6 6 6 6 6 1 1 1 1 1 1 1 1 1 1 1 1 1 1 1 1 1 1
symmnumber: 1
zpe: 814675.8 jmol-1
zpe.correction: 0.310294 hartree
zpe.thermalcorrener: 0.330519 hartree
zpe.thermalcorrenthalpy: 0.331464 hartree
zpe.thermalcorrgfe: 0.259526 hartree
zpe.sumelectzpe: -913.170498 hartree
zpe.sumelectthermal: -913.150273 hartree
zpe.sumelectthermalent: -913.149329 hartree
zpe.sumelectthermalfe: -913.221266 hartree
dipole: -5.0480 -4.3291 -1.9949
dipole: 6.9428
quadrupole: -156.8942 -124.5222 -127.9024
quadrupole: -0.3415 7.6206 5.9854
quadrupole: -20.4546 11.9174 8.5372 -0.3415 7.6206 5.9854
hfenergy: -913.4807921 hartree
pointgroup: C01 [X(C16H18N4O1)]
dipole: 2.0059941 1.6865381 -0.7699132 debye
polarizability: 240.4893743|26.0840171|186.1981702|9.5690666|-6.4235757|165.12555 unknown
InChI: InChI=1S/C16H18N4O/c1-16(2,3)14(15(21)20-11-18-10-19-20)8-12-4-6-13(9-17)7-5-12/h4-7,10-11,14H,8H2,1-3H3
charge 0 multiplicity 1
39 atoms
O  1.694912 -0.462633 1.907766
N  1.350843 -1.689072 -0.052779
N  1.531519 -2.923689 0.616099
N  0.921722 -3.260934 -1.607954
N  -6.143534 -0.216256 -0.132014
C  2.974096 1.414287 -0.353167
C  1.500324 0.843211 -0.155882
C  0.521699 1.848629 0.535343
C  2.930305 2.514304 -1.448929
C  3.908283 0.273315 -0.845764
C  3.540106 2.006852 0.962848
C  1.525128 -0.445742 0.671345
C  -0.931924 1.417407 0.407686
C  -1.693812 1.777164 -0.735854
C  -1.54954 0.622326 1.409378
C  0.986217 -1.93962 -1.383355
C  -3.030573 1.360341 -0.882132
C  -2.885489 0.196639 1.276474
C  -3.63811 0.562106 0.126591
C  1.265919 -3.815398 -0.363469
C  -5.00655 0.136553 -0.013771
H  1.114703 0.63346 -1.170889
H  0.805397 1.930427 1.598538
H  0.657212 2.841136 0.070966
H  2.563731 2.111282 -2.41251
H  2.288509 3.367835 -1.164387
H  3.947573 2.912983 -1.61739
H  4.905413 0.68534 -1.08549
H  3.518547 -0.209751 -1.762135
H  4.050371 -0.508029 -0.076824
H  4.587978 2.322855 0.805595
H  3.520694 1.267548 1.78199
H  2.970276 2.895497 1.288548
H  -1.238557 2.402414 -1.51375
H  -0.977764 0.337809 2.299804
H  0.763951 -1.17182 -2.11684
H  -3.611499 1.649454 -1.763679
H  -3.352321 -0.413731 2.055751
H  1.319142 -4.886497 -0.187359
