program: Gaussian 09
title: 000184232
version: EM64L-G09RevD.01
frameworkgroup: C1[X(C11H18N2O)]
method: RPBEPBE
basis: SDD
operation: Freq
keyword: #p
keyword: freq=noraman
keyword: PBEPBE/SDD
title: #p freq=noraman PBEPBE/SDD
converged: YES YES NO NO
title: Mulliken charges:
elementType: O N N C C C C C C C C C C C H H H H H H H H H H H H H H H H H H
charge: -0.214785 -0.204598 -0.080722 0.277964 -0.133561 -0.430867 -0.723364 -0.730811 -0.735412 0.209796 -0.705381 -0.161811 -0.171806 -0.328211 0.199302 0.208313 0.249402 0.221655 0.206507 0.215804 0.215676 0.219402 0.237369 0.221094 0.260953 0.204494 0.232809 0.224059 0.205193 0.262815 0.290695 0.258027
chargesum: 0.00000
title: Mulliken charges with hydrogens summed into heavy atoms:
elementType: O N N C C C C C C C C C C C
charge: -0.214785 -0.204598 -0.080722 0.277964 0.065740 0.026848 -0.079398 -0.058363 -0.048871 0.209796 -0.043320 0.101003 0.118889 -0.070183
polarizability: 1.60463785e+02 5.89819858e+00 1.10316123e+02 4.92068243e+00 4.92451660e+00 1.23055919e+02
1716.lowfreq: -17.1007 -3.6957 -0.0005 0.0003 0.0005 9.5685 35.9911 46.0421 61.2984
frequency: 35.9009 45.9901 61.2486 78.8751 136.1077 161.2033 188.0072 190.3270 206.9936 235.7205 249.9004 265.8109 282.2654 296.8292 320.8306 331.0006 373.5662 396.4530 424.9727 494.4340 511.1854 597.1673 640.1424 680.5659 712.6956 717.9515 779.1052 819.6145 823.0961 857.9342 858.9855 871.3316 925.0702 928.1011 936.3011 946.2698 949.1009 1006.9867 1013.6485 1021.9906 1046.4466 1063.5174 1092.6219 1103.1761 1115.2316 1177.5268 1195.9935 1219.1899 1226.3532 1233.1996 1248.0858 1261.5259 1288.2133 1325.5619 1327.3479 1366.3736 1377.5588 1384.6780 1393.8210 1407.9816 1437.9192 1456.0534 1461.0834 1468.4447 1471.8043 1477.4966 1481.7708 1483.9074 1487.4464 1489.0227 1498.3890 1617.6829 2970.8474 2973.4605 2975.3051 2982.9268 3005.4013 3011.5631 3053.5751 3063.7787 3067.9172 3071.1902 3072.1680 3077.1311 3078.5622 3082.1183 3091.4634 3231.6564 3260.3313 3269.4765
redmass: 4.8324 3.5671 2.7529 2.2347 3.6287 6.3152 2.3819 2.2266 1.1073 1.9706 1.0755 1.2311 2.5147 1.8417 3.3249 2.8115 2.7554 2.5454 2.6310 2.8733 4.9274 3.0405 3.7207 4.1332 2.0288 1.3077 3.3289 1.4424 1.8682 1.5035 2.2058 4.9035 1.9093 1.6092 1.9949 1.9459 1.6818 2.1606 1.4581 1.4269 2.2084 3.1332 1.6615 1.6440 2.0493 1.9111 1.9167 2.4487 3.1043 3.9116 1.6364 1.4028 1.5878 2.1144 1.4378 2.0342 1.2002 1.2059 1.2096 1.2084 3.9235 1.0622 1.0540 1.0624 1.0510 1.0601 1.0968 1.0516 2.1245 1.3495 1.0578 9.0922 1.0354 1.0357 1.0362 1.0365 1.0625 1.0801 1.0997 1.0995 1.0992 1.0997 1.0989 1.0986 1.0981 1.1018 1.0996 1.0928 1.0977 1.1082
irintensity: 0.0200 1.7784 0.1221 0.0621 0.1251 4.6440 0.8144 0.3751 0.1609 1.3294 0.0174 0.0947 0.5154 2.1293 4.4458 0.6247 0.4292 0.3380 0.8288 1.7272 2.4047 3.3479 12.5820 8.9035 6.4635 42.9646 9.9164 41.1283 38.0072 2.4057 8.7757 0.3837 5.0032 0.8899 2.1438 21.4822 22.3207 30.1659 1.4009 3.6741 3.7168 12.5416 9.9693 34.5491 31.1756 88.0194 184.9963 30.6932 38.8754 3.6474 98.7544 53.1248 6.7990 1.3457 2.1120 108.0742 25.6380 23.6430 9.6522 22.5833 65.4091 0.8475 3.8476 1.7297 2.4058 11.5692 10.9138 14.3660 16.4320 8.7755 25.8110 120.1799 29.7749 26.4541 27.0556 24.9931 17.1755 26.0131 2.4000 2.1797 30.5637 22.1267 35.3844 35.0815 94.4876 43.2668 25.4975 3.2449 1.4465 3.8026
temp: 298.150 k
press: 1.00000 atm
elementType: 8 7 7 6 6 6 6 6 6 6 6 6 6 6 1 1 1 1 1 1 1 1 1 1 1 1 1 1 1 1 1 1
symmnumber: 1
zpe: 714158.5 jmol-1
zpe.correction: 0.272009 hartree
zpe.thermalcorrener: 0.287381 hartree
zpe.thermalcorrenthalpy: 0.288325 hartree
zpe.thermalcorrgfe: 0.229543 hartree
zpe.sumelectzpe: -613.597089 hartree
zpe.sumelectthermal: -613.581716 hartree
zpe.sumelectthermalent: -613.580772 hartree
zpe.sumelectthermalfe: -613.639555 hartree
dipole: 3.6290 -0.1701 -3.0822
dipole: 4.7643
quadrupole: -98.4823 -85.6437 -86.1754
quadrupole: -1.3005 2.9093 -0.4835
quadrupole: -8.3818 4.4567 3.9251 -1.3005 2.9093 -0.4835
hfenergy: -613.8690975 hartree
pointgroup: C01 [X(C11H18N2O1)]
dipole: -1.4213181 -0.1840508 -1.2080746 debye
polarizability: 159.0551048|9.8291862|110.8262125|-5.2785925|-4.0551734|123.954511 unknown
InChI: InChI=1S/C11H18N2O/c1-5-9(11(2,3)4)10(14)13-7-6-12-8-13/h6-9H,5H2,1-4H3
charge 0 multiplicity 1
32 atoms
O  0.054083 -0.411214 1.914254
N  1.421195 0.134506 0.121685
N  3.615203 0.747137 0.163653
C  -2.065748 0.706838 -0.188589
C  -1.017489 -0.487934 -0.290258
C  -1.622286 -1.894269 -0.009258
C  -3.022965 0.621861 -1.409002
C  -1.316394 2.067396 -0.252017
C  -2.886583 0.638306 1.125224
C  0.1511 -0.264606 0.66923
C  -0.672043 -3.04549 -0.405251
C  1.816019 0.339987 -1.224623
C  2.563768 0.400949 0.912627
C  3.151789 0.70903 -1.175877
H  -0.644411 -0.482262 -1.332136
H  -2.569852 -1.994326 -0.569939
H  -1.865412 -1.968551 1.065512
H  -3.762364 1.442659 -1.362714
H  -2.469505 0.720552 -2.362486
H  -3.585053 -0.328764 -1.433817
H  -0.672165 2.139753 -1.148733
H  -2.04595 2.896896 -0.294865
H  -0.682974 2.229758 0.639242
H  -3.539387 -0.252239 1.151647
H  -2.227976 0.606153 2.010254
H  -3.534932 1.530886 1.205223
H  0.269048 -3.013236 0.174448
H  -1.143846 -4.025758 -0.212513
H  -0.410888 -3.003611 -1.479837
H  1.145528 0.203735 -2.065926
H  2.535792 0.316914 1.994899
H  3.815401 0.950143 -2.002956
